program: Gaussian 09
title: 000298517
version: EM64L-G09RevD.01
frameworkgroup: C1[X(C8H7NO3)]
method: RPBEPBE
basis: SDD
operation: Freq
keyword: #pfreq=noraman
keyword: PBEPBE/SDD
title: #p freq=noraman PBEPBE/SDD
converged: NO YES NO YES
title: Mulliken charges:
elementType: O O O N C C C C C C C C H H H H H H H
charge: -0.432975 -0.225401 -0.230494 0.097182 0.325682 0.178385 -0.339287 -0.390325 -0.252279 -0.226316 -0.193827 -0.196393 0.232401 0.227621 0.311609 0.238016 0.237540 0.268790 0.370071
chargesum: 0.00000
title: Mulliken charges with hydrogens summed into heavy atoms:
elementType: O O O N C C C C C C C C
charge: -0.062903 -0.225401 -0.230494 0.097182 0.325682 0.178385 -0.106886 -0.162704 -0.014263 0.085292 0.043713 0.072398
polarizability: 2.12226772e+02 5.06347476e+00 1.18278444e+02 -2.97125348e-04 -6.07835258e-03 4.02583826e+01
1716.lowfreq: 0.0010 0.0012 0.0013 3.8448 4.9049 13.1673 38.4475 82.5974 97.7615
frequency: 38.4049 82.5962 97.7592 148.3400 202.7789 242.6149 272.8263 305.7358 385.3430 455.6246 459.0504 497.3747 533.7712 555.6304 592.9031 659.5276 674.0836 741.7989 759.0487 789.1961 849.1783 854.0345 854.9664 938.3465 942.6479 981.6363 1021.6439 1040.8424 1073.7082 1145.8896 1175.1552 1200.4136 1220.0139 1239.5882 1263.2895 1295.2428 1319.1933 1380.9220 1396.3826 1445.3029 1491.7478 1590.0606 1611.9883 1629.7481 3123.1482 3142.2738 3144.8803 3154.1634 3175.1111 3200.4506 3588.0025
redmass: 8.3057 5.6046 7.0110 3.3522 4.0971 8.6042 7.6248 3.2425 1.1107 4.9236 2.8450 6.6280 3.2989 5.8582 7.1482 5.4301 8.6561 3.8482 1.2909 6.2025 1.4523 1.7930 5.0820 5.7117 1.3805 1.3405 1.2290 2.1452 2.2960 1.3619 1.1092 1.8674 2.5355 1.7803 3.0019 1.9317 1.3532 4.8946 6.4707 2.5704 2.5402 6.1938 6.4783 5.7711 1.0889 1.0875 1.0893 1.0940 1.1005 1.0945 1.0663
irintensity: 0.0739 0.0012 1.0297 2.4216 0.0133 0.3948 4.7931 7.5497 145.3365 10.0317 9.9640 1.2550 2.9672 3.2122 21.4183 0.0192 5.9862 0.0063 103.3250 19.3085 4.9691 26.4778 6.5530 29.0646 0.4430 0.6234 43.0596 1.1897 102.5038 92.9188 34.4649 204.7467 265.4118 10.0416 106.7594 7.3317 48.8621 85.9580 64.5228 59.1310 15.5402 9.1038 69.1110 172.7649 11.9745 0.4859 5.6519 14.5421 18.1629 9.2904 55.7482
temp: 298.150 k
press: 1.00000 atm
elementType: 8 8 8 7 6 6 6 6 6 6 6 6 1 1 1 1 1 1 1
symmnumber: 1
zpe: 358786.3 jmol-1
zpe.correction: 0.136654 hartree
zpe.thermalcorrener: 0.147136 hartree
zpe.thermalcorrenthalpy: 0.148080 hartree
zpe.thermalcorrgfe: 0.099501 hartree
zpe.sumelectzpe: -588.510217 hartree
zpe.sumelectthermal: -588.499736 hartree
zpe.sumelectthermalent: -588.498792 hartree
zpe.sumelectthermalfe: -588.547371 hartree
dipole: 8.4702 -0.1868 0.0006
dipole: 8.4722
quadrupole: -79.9447 -59.7193 -72.0063
quadrupole: 6.2112 0.0068 0.0090
quadrupole: -9.3879 10.8374 -1.4496 6.2112 0.0068 0.0090
hfenergy: -588.6468719 hartree
pointgroup: C01 [X(C8H7N1O3)]
dipole: -3.3323769 0.0708867 -0.0252608 debye
dipolederiv: -0.0088876 0.343526 0.0056112 -0.0934475 -1.3079118 -0.0077213 0.0022196 -0.0043789 -0.4061923 -0.9974582 -0.2589202 -0.0082055 -0.2549653 -0.6037819 -0.0051536 -0.0082166 -0.0052234 -0.2531424 -0.6781638 0.113897 -0.002517 0.4381122 -0.7609166 -0.0012735 0.000149 -0.0036795 -0.2364485 2.1934825 0.068947 0.0165981 -0.502086 1.0773933 0.0040595 0.0119289 0.008426 0.1918028 -0.6991764 -0.1055031 -0.0060579 0.3884794 -0.2064311 0.0015975 -0.0020144 -0.002176 -0.0234839 0.1623088 -0.4029376 -0.0023736 0.3004988 1.20977 0.0111311 0.0031348 0.0056911 0.070437 0.3016395 0.0559865 0.0035045 -0.3989926 0.0725268 -0.0017793 -0.0001413 0.001769 -0.104727 0.0149529 0.4173913 0.004763 0.0794198 -0.2447158 0.0001888 0.0021307 0.0027297 -0.1886338 -0.5581064 -0.1200896 -0.0038694 -0.241125 0.0236333 -0.0003012 -0.0047262 0.0006482 -0.1794124 1.2582155 0.0240947 0.0101362 0.1313474 -0.0059692 0.0011619 0.0112005 0.0003007 -0.0180449 0.1526176 -0.023944 0.0018305 0.3216252 0.218836 0.005043 0.0044933 0.0023545 -0.1133221 -1.3958199 0.0514435 -0.0093296 -0.2304481 0.0843243 0.0001377 -0.0115204 0.0023575 -0.1547089 0.0163974 -0.1074764 -0.0017581 -0.0620477 0.0110311 -0.0014644 -0.0014263 -0.0018273 0.1416739 0.0124443 -0.0695327 -0.0017839 -0.1219798 -0.0648139 -0.0027799 -0.0021799 -0.0023688 0.1758856 0.1184449 0.0193543 -0.0002509 0.043039 0.0803685 -0.0003994 -0.000234 -0.0005899 0.1715528 0.0509021 0.0481771 -0.0005535 0.0775881 -0.0790177 -0.0013237 -0.0002981 -0.0015507 0.1715042 -0.0973095 0.0400473 -0.0016388 0.0419089 0.0885215 -0.0002099 -0.0016272 -0.0002229 0.1578204 0.0478517 0.019918 -0.0010891 0.0801885 0.0105916 -0.0009863 -0.0007649 -0.0014673 0.2044109 0.1056646 -0.1143791 -0.0030161 0.0028848 0.3965617 0.000073 -0.0021074 -0.000792 0.3930286 unknown
polarizability: 212.2076226|5.1319762|118.2814818|1.385128|0.6624854|40.2744946 unknown
InChI: InChI=1S/C8H7NO3/c10-8-4-2-1-3-7(8)5-6-9(11)12/h1-6,10H
charge 0 multiplicity 1
19 atoms
O  -1.129325 -2.291864 -0.032069
O  4.143815 0.980263 0.035891
O  3.439995 -1.199766 0.0109
N  3.21214 0.074837 0.020212
C  -0.626167 0.065723 -0.010109
C  -1.606996 -0.976736 -0.025605
C  -1.096208 1.411663 -0.00339
C  -2.990125 -0.682266 -0.033882
C  -2.469109 1.712513 -0.011544
C  0.788147 -0.298214 -0.002037
C  -3.418776 0.660164 -0.026837
C  1.840456 0.569999 0.013361
H  -0.369258 2.230571 0.008375
H  -3.725931 -1.496093 -0.04573
H  1.026962 -1.368857 -0.008895
H  -2.804338 2.754021 -0.006102
H  -4.49031 0.885516 -0.033268
H  1.803088 1.659984 0.02217
H  -1.868858 -2.94846 -0.042542
