program: Gaussian 09
title: 000298572
version: EM64L-G09RevD.01
frameworkgroup: C1[X(C20H18O2S)]
method: RPBEPBE
basis: SDD
operation: Freq
keyword: #p
keyword: freq=noraman
keyword: PBEPBE/SDD
title: #p freq=noraman PBEPBE/SDD
converged: YES YES NO NO
title: Mulliken charges:
elementType: S O O C C C C C C C C C C C C C C C C C C C C H H H H H H H H H H H H H H H H H H
charge: 0.650507 -0.477837 -0.617726 0.026741 -0.808560 0.391189 0.395333 -0.390976 -0.387187 -0.387716 -0.372676 -0.118482 -0.222877 -0.251275 -0.239684 -0.223896 -0.239467 -0.239580 -0.241895 -0.248372 -0.211449 -0.210002 -0.223041 0.271460 0.335987 0.294752 0.224577 0.254261 0.280570 0.368370 0.225370 0.223989 0.223830 0.226263 0.227104 0.228275 0.308500 0.243733 0.239643 0.236429 0.235815
chargesum: 0.00000
title: Mulliken charges with hydrogens summed into heavy atoms:
elementType: S O O C C C C C C C C C C C C C C C C C C C C
charge: 0.650507 -0.109467 -0.617726 0.026741 -0.201114 0.391189 0.395333 -0.096224 -0.162610 -0.133455 -0.092106 -0.118482 0.002493 -0.027286 -0.015853 0.002367 -0.012363 -0.011305 0.066604 -0.004639 0.028194 0.026427 0.012774
polarizability: 2.75134874e+02 -1.75312033e+01 2.31644364e+02 3.64241886e+00 -6.34205098e+00 2.14578603e+02
1716.lowfreq: -7.8380 -3.9818 -0.0004 0.0003 0.0014 2.3832 18.9320 25.8815 31.3617
frequency: 18.7715 25.8553 31.3508 39.2435 43.8510 63.2065 81.9429 103.9633 168.9683 183.5124 204.9312 216.6731 237.4663 246.6039 276.3312 299.4079 332.1958 353.5661 387.7328 401.9489 403.8573 406.0696 413.2333 453.4291 472.5304 481.1656 522.5745 554.7715 588.0166 605.7790 615.7524 616.7145 646.2830 657.6801 698.1035 702.4976 704.8615 707.8085 738.8283 756.3904 760.9442 774.9990 812.3961 849.7874 855.1883 857.0969 859.5330 899.9225 930.5821 932.1379 936.3816 977.2411 979.6679 980.6433 984.3118 986.2133 989.7650 989.9267 1000.1907 1000.7909 1007.1899 1010.6395 1023.8941 1027.2928 1039.0894 1045.6964 1074.2172 1079.3992 1088.2941 1133.8033 1165.9218 1171.5137 1172.0092 1174.0171 1176.5333 1187.5515 1190.2777 1212.0891 1245.0522 1300.4420 1309.2320 1315.5377 1379.3766 1381.5890 1382.8499 1401.1071 1429.9564 1431.2635 1434.6789 1454.7378 1472.6989 1478.8963 1488.7528 1582.2803 1589.6158 1591.1254 1599.5916 1606.5403 1611.5237 2934.3331 3046.4078 3113.2752 3121.5764 3126.4925 3127.8148 3129.4048 3131.2468 3139.1525 3139.8604 3140.6167 3143.9150 3153.8056 3157.2002 3158.9716 3168.8753 3170.4978 3177.1262
redmass: 5.2221 4.2848 5.3107 4.0115 4.4538 4.7948 6.1356 5.1737 6.3462 5.6981 4.8108 4.4494 5.4029 5.1856 5.3836 6.1220 8.4132 4.0480 4.8174 3.1478 2.8631 2.9417 7.2590 4.0370 4.0244 3.5962 4.0417 5.8147 3.7789 6.4798 6.4070 6.4227 5.6647 6.6319 2.5234 3.7430 1.9706 1.7011 11.5642 1.4847 1.8557 2.0278 1.0975 2.2963 1.2447 1.2661 1.2420 2.3887 1.4317 1.3727 1.7555 2.0042 2.1170 2.1547 1.5862 1.4153 5.6692 5.3986 1.3302 1.3508 1.3930 3.4689 2.7023 2.1538 2.9976 2.1071 1.5703 1.5632 1.6283 1.7306 1.4204 1.0768 1.0765 1.3762 1.1098 1.1809 1.2116 1.6402 1.8504 1.3130 1.3519 1.3367 8.4010 8.7313 8.9910 1.1055 2.1637 2.1729 2.2210 2.0453 1.8130 2.2047 1.3504 5.8390 6.1182 6.1936 6.7391 6.0533 6.1005 1.0709 1.0557 1.0861 1.0845 1.0870 1.0871 1.0886 1.0885 1.1025 1.0910 1.0991 1.0939 1.0959 1.0969 1.0989 1.1013 1.0980 1.0952
irintensity: 0.5138 0.2544 0.4617 0.1405 0.1440 0.0909 0.3001 1.6807 4.4800 3.0810 3.2226 4.1953 1.2466 6.6951 2.5923 7.5509 4.8171 9.8033 14.5018 3.2578 0.0645 0.3254 20.6337 2.5175 12.2454 13.3214 3.4758 5.1985 38.0623 0.3037 0.0269 0.3103 8.8625 4.5337 25.8169 17.2857 23.9480 88.2848 49.9251 57.2259 49.4792 32.5088 144.6305 2.4188 0.5308 0.9470 5.7806 18.3547 8.3203 2.4166 6.1768 18.6408 2.5706 10.5414 7.5233 2.0024 2.5009 0.3686 0.5297 2.2180 1.5583 7.7252 8.9504 16.6443 12.8625 8.1959 7.3940 3.4385 7.6059 1.5424 12.1259 3.0131 0.6706 6.6732 4.8135 4.8768 2.9073 6.8446 24.7918 3.9505 1.1768 2.3571 1.0266 1.2284 1.9644 13.9757 8.1943 14.5974 11.6778 25.2779 51.3143 13.2054 91.2863 14.0714 0.5559 0.3634 2.8932 5.6288 1.8787 535.7392 3.8014 17.6290 0.5363 2.8039 3.2002 5.5719 8.9794 10.1575 2.3189 20.7159 30.4360 18.6451 24.9609 29.5319 34.3845 13.5509 10.5454
temp: 298.150 k
press: 1.00000 atm
elementType: 16 8 8 6 6 6 6 6 6 6 6 6 6 6 6 6 6 6 6 6 6 6 6 1 1 1 1 1 1 1 1 1 1 1 1 1 1 1 1 1 1
symmnumber: 1
zpe: 840786.0 jmol-1
zpe.correction: 0.320238 hartree
zpe.thermalcorrener: 0.340477 hartree
zpe.thermalcorrenthalpy: 0.341421 hartree
zpe.thermalcorrgfe: 0.268627 hartree
zpe.sumelectzpe: -1319.738005 hartree
zpe.sumelectthermal: -1319.717766 hartree
zpe.sumelectthermalent: -1319.716822 hartree
zpe.sumelectthermalfe: -1319.789616 hartree
dipole: -2.4206 1.6330 4.3763
dipole: 5.2610
quadrupole: -123.8964 -139.6249 -135.3566
quadrupole: -9.2292 -1.5713 -5.4681
quadrupole: 9.0629 -6.6656 -2.3973 -9.2292 -1.5713 -5.4681
hfenergy: -1320.058243 hartree
pointgroup: C01 [X(C20H18O2S1)]
dipole: -1.024274 0.7768444 1.6222328 debye
polarizability: 270.1599336|-20.782101|235.2836271|8.2207519|-8.9790501|215.9142809 unknown
InChI: InChI=1S/C20H18O2S/c21-20(17-10-4-1-5-11-17,18-12-6-2-7-13-18)16-23(22)19-14-8-3-9-15-19/h1-15,21H,16H2
charge 0 multiplicity 1
41 atoms
S  -1.714736 -1.161701 -0.065022
O  0.747836 0.021852 -1.792622
O  -1.458169 -1.443881 -1.720668
C  0.92933 -0.002411 -0.340134
C  -0.447172 0.294571 0.315523
C  1.844075 1.193275 0.024545
C  1.541396 -1.347677 0.112634
C  2.004681 2.249564 -0.905444
C  1.305723 -1.913081 1.39152
C  2.483868 1.277599 1.286957
C  2.409276 -2.022522 -0.782132
C  -3.281807 -0.085852 -0.051419
C  2.796411 3.372919 -0.577019
C  1.919794 -3.130375 1.766491
C  3.268818 2.40454 1.616108
C  3.027384 -3.233676 -0.407267
C  3.426887 3.45812 0.685653
C  2.785133 -3.794212 0.86933
C  -3.817016 0.265093 -1.301065
C  -3.881042 0.276971 1.169574
C  -5.000628 1.038916 -1.327043
C  -5.063697 1.053641 1.127811
C  -5.619308 1.434056 -0.117087
H  -0.429788 0.374465 1.413845
H  -0.891508 1.191185 -0.142544
H  1.521884 2.15668 -1.881804
H  0.641051 -1.417629 2.109729
H  2.397074 0.453583 2.003754
H  2.572796 -1.587032 -1.772404
H  -0.044455 -0.595184 -2.000019
H  2.922585 4.180164 -1.307647
H  1.720204 -3.558359 2.755566
H  3.764436 2.455679 2.592282
H  3.693793 -3.744598 -1.111417
H  4.040226 4.330168 0.939711
H  3.260909 -4.738071 1.158292
H  -3.309195 -0.078669 -2.210811
H  -3.454543 -0.032671 2.130798
H  -5.439371 1.327349 -2.288249
H  -5.549073 1.353578 2.062727
H  -6.53716 2.031534 -0.14333
