program: Gaussian 09
title: 000298514
version: EM64L-G09RevD.01
frameworkgroup: C1[X(C6H7N3O2)]
method: RPBEPBE
basis: SDD
operation: Freq
keyword: #pfreq=noraman
keyword: PBEPBE/SDD
title: #p freq=noraman PBEPBE/SDD
converged: YES YES NO NO
title: Mulliken charges:
elementType: O O N N N C C C C C C H H H H H H H
charge: -0.208900 -0.169464 -0.005139 0.039893 -0.636370 0.339848 -0.005762 -0.274366 -0.765744 -0.311294 0.155703 0.245137 0.261664 0.241690 0.208962 0.228631 0.337614 0.317898
chargesum: 0.00000
title: Mulliken charges with hydrogens summed into heavy atoms:
elementType: O O N N N C C C C C C
charge: -0.208900 -0.169464 -0.005139 0.039893 0.019143 0.339848 -0.005762 -0.029229 -0.053429 -0.082663 0.155703
polarizability: 1.34102566e+02 5.92636129e+00 1.11207955e+02 2.06146252e+00 2.74039095e+00 4.68741452e+01
1716.lowfreq: -9.3462 -4.0959 -0.0003 0.0005 0.0006 4.8651 44.9535 100.9296 156.7423
frequency: 44.9283 100.9279 156.7379 162.3984 201.4341 295.3705 313.1426 368.1928 377.0194 379.0262 431.4097 478.4289 487.9361 521.9206 602.9315 657.6838 710.7131 747.7624 750.2725 756.6549 824.9721 910.1271 956.5996 985.6918 1035.6640 1043.3337 1071.0365 1158.8526 1207.2638 1247.4828 1334.8408 1345.8022 1383.7546 1395.9631 1408.8802 1456.6015 1470.1649 1493.2690 1538.7282 1608.0699 1632.4343 2992.4289 3080.5065 3090.1805 3137.4640 3160.7313 3555.6437 3708.8977
redmass: 10.7654 3.6265 1.2371 3.0153 6.6417 3.4753 3.5009 3.8354 2.1108 2.1210 3.6667 5.3285 1.7788 1.6959 5.0207 8.7262 5.3764 4.9992 10.9325 5.8933 1.5758 4.4301 1.3272 1.6737 1.6997 1.5067 2.9812 1.2835 11.5425 2.6904 3.0195 2.9637 9.4403 5.0460 1.2869 1.1036 1.1410 3.7376 4.2105 1.7609 2.7921 1.0364 1.0974 1.1006 1.0883 1.0981 1.0452 1.1047
irintensity: 0.5734 1.2643 3.2652 2.7323 1.7071 5.0185 3.0621 17.3740 76.9032 73.6786 2.4091 3.0394 99.2180 71.8719 1.1260 12.1882 1.8513 0.0054 21.8227 4.1429 47.4543 5.7292 0.1236 1.9443 5.5138 6.8519 4.8041 7.4013 157.2971 4.2357 0.1237 11.2567 194.2408 22.1726 12.2986 12.6761 10.5611 132.7906 45.0438 8.8290 437.4152 22.8945 10.5398 21.0241 9.3215 15.9505 108.4745 39.3708
temp: 298.150 k
press: 1.00000 atm
elementType: 8 8 7 7 7 6 6 6 6 6 6 1 1 1 1 1 1 1
symmnumber: 1
zpe: 345602.8 jmol-1
zpe.correction: 0.131633 hartree
zpe.thermalcorrener: 0.141746 hartree
zpe.thermalcorrenthalpy: 0.142691 hartree
zpe.thermalcorrgfe: 0.095864 hartree
zpe.sumelectzpe: -546.655862 hartree
zpe.sumelectthermal: -546.645749 hartree
zpe.sumelectthermalent: -546.644805 hartree
zpe.sumelectthermalfe: -546.691631 hartree
dipole: -5.9110 3.6791 -0.1001
dipole: 6.9632
quadrupole: -53.9393 -61.4706 -66.4119
quadrupole: 7.9634 -1.9525 -2.2896
quadrupole: 6.6680 -0.8633 -5.8046 7.9634 -1.9525 -2.2896
hfenergy: -546.7874955 hartree
pointgroup: C01 [X(C6H7N3O2)]
dipole: -2.3924271 1.3346406 0.0015723 debye
dipolederiv: -0.7774924 -0.0296929 -0.2350935 -0.0110597 -0.4266099 -0.1517189 -0.1166911 -0.1901431 -0.3948218 -0.4623277 0.1906555 0.0156885 0.1619148 -0.7096169 -0.2679908 -0.0400912 -0.2544944 -0.3668195 -0.7379133 -0.630436 0.0051214 0.0370713 -0.4078667 0.0306719 0.0546189 -0.0148192 -0.2057596 1.1695269 -0.3649758 0.257749 -0.2970354 1.0095172 0.4808865 0.1861545 0.4620571 0.5172306 -1.061193 -0.6857646 -0.0029139 -0.8456024 -0.6652097 0.0126699 0.0060614 0.021296 -0.74307 -0.1236675 0.2741947 0.0044139 0.2194258 -0.1008678 0.0015984 -0.0222044 0.0642582 -0.0031106 0.1871622 0.4530388 -0.0579505 0.0841188 0.2777587 -0.0755473 -0.0699543 -0.0126899 0.0567825 0.2952658 -0.172193 0.0035228 0.038924 0.1999901 0.0016112 0.0127959 -0.0142009 -0.1266994 -0.0664456 -0.1764307 0.0001983 -0.0857831 0.0890816 -0.0309014 -0.0451745 -0.0615404 0.0610042 -0.1503012 0.0007257 0.0059693 -0.6145755 -0.2418908 0.0013248 0.0091971 -0.0048526 -0.1595481 1.2244378 0.9242785 -0.0038647 1.1196459 0.6343485 -0.0155239 0.0146291 -0.0324617 0.1930046 0.0934381 -0.001912 0.0030991 0.0263695 -0.0904393 0.0024474 0.0001015 0.0074906 0.1424322 0.0462123 -0.057794 -0.0607078 -0.0325094 0.0785347 0.0261978 -0.0738568 -0.0220982 -0.0396409 -0.0124231 0.0040562 0.0852741 0.0466377 0.0429041 -0.0650182 0.094043 -0.0183993 0.0132278 0.0538736 0.1179204 -0.0240214 -0.0034094 -0.1455856 0.0500829 0.0036493 0.0703047 0.0949482 -0.0911251 0.0602226 -0.0032781 0.0516123 0.064843 0.0032899 -0.0085411 0.0074226 0.172586 0.168875 0.033088 0.0056218 0.0709503 0.2462998 -0.0024105 -0.0011907 -0.0093808 0.3917437 0.2440973 0.0610186 0.0011717 0.0333043 0.1448091 -0.0016697 -0.0035464 0.0022513 0.3965101 unknown
polarizability: 133.3751847|6.7356676|111.2215356|3.8751145|6.9678247|47.5879452 unknown
InChI: InChI=1S/C6H7N3O2/c1-4-2-3-5(7)8-6(4)9(10)11/h2-3H,7H2,1H3
charge 0 multiplicity 1
18 atoms
O  2.683577 -0.375398 0.622161
O  1.785089 -2.005507 -0.695598
N  -0.677736 -1.001218 -0.032501
N  1.704653 -0.909291 -0.035452
N  -2.9888 -1.326972 -0.0247
C  0.363528 1.239177 -0.010552
C  0.38845 -0.178341 -0.020578
C  -0.954596 1.786551 -0.03559
C  1.57339 2.149132 0.005157
C  -2.097156 0.973761 -0.042863
C  -1.923976 -0.447138 -0.032827
H  -1.068911 2.876009 -0.05045
H  2.045318 2.165877 1.003003
H  2.356985 1.817558 -0.697713
H  1.27596 3.178183 -0.262251
H  -3.099212 1.413756 -0.060773
H  -2.787681 -2.324601 -0.036304
H  -3.950985 -1.003236 -0.01437
