program: Gaussian 09
title: 000298500
version: EM64L-G09RevD.01
frameworkgroup: C1[X(C13H8N2O2)]
method: RPBEPBE
basis: SDD
operation: Freq
keyword: #p
keyword: freq=noraman
keyword: PBEPBE/SDD
title: #p freq=noraman PBEPBE/SDD
converged: NO NO NO NO
title: Mulliken charges:
elementType: O O N N C C C C C C C C C C C C C H H H H H H H H
charge: -0.203962 -0.209227 -0.013965 0.019828 0.473503 0.418729 -0.122411 -0.079032 -0.436772 -0.534601 -0.271991 0.382311 -0.386834 -0.376291 -0.307276 -0.243722 -0.217117 0.261711 0.293237 0.274167 0.241953 0.291065 0.270870 0.236969 0.238861
chargesum: 0.00000
title: Mulliken charges with hydrogens summed into heavy atoms:
elementType: O O N N C C C C C C C C C C C C C
charge: -0.203962 -0.209227 -0.013965 0.019828 0.473503 0.418729 -0.122411 -0.079032 -0.175062 -0.241365 0.002176 0.382311 -0.144881 -0.085226 -0.036406 -0.006754 0.021744
polarizability: 3.52048356e+02 1.23271659e+01 1.64944441e+02 -1.63619089e-02 1.68681409e-02 5.92106054e+01
1716.lowfreq: -14.7797 -9.1860 -0.0010 0.0001 0.0007 3.7087 53.4577 60.0878 111.4062
frequency: 53.4381 60.0218 111.3996 142.8470 159.8790 257.3934 259.5274 294.9826 301.8804 393.3645 411.1623 457.2181 473.1339 481.8704 511.0395 516.9940 543.1125 584.5330 609.9024 622.4230 678.4496 700.9673 729.5727 757.8779 766.4687 766.9789 802.3779 824.8182 859.9381 875.3557 892.5000 906.3794 940.6381 957.3088 977.5767 1000.8157 1002.9302 1010.4935 1069.7252 1114.7352 1134.7362 1166.9526 1189.7487 1211.5490 1229.8854 1244.4341 1270.2190 1287.8827 1332.7344 1351.5290 1376.1729 1401.3995 1421.2747 1441.4736 1456.9528 1479.5063 1529.8784 1557.2404 1579.1013 1613.9055 1635.6699 3128.2886 3129.7709 3143.0332 3161.6991 3163.5113 3167.3045 3175.3756 3191.7247
redmass: 10.3042 7.1282 4.3861 8.1881 6.0112 4.8157 6.4369 9.6999 4.7745 3.7574 5.5466 7.4023 2.9725 2.9536 4.0759 7.2574 6.8316 4.0204 7.5105 7.8418 7.3922 5.1040 6.4357 2.5633 1.4846 8.6792 2.3991 4.6277 1.8087 1.4922 5.8060 1.5504 4.8093 1.5995 1.4155 1.3387 1.3174 2.2389 2.3179 1.6895 1.3827 1.1231 1.5432 5.2220 1.9153 3.0291 1.5806 2.9887 3.7658 2.3231 6.3980 2.8081 7.0764 3.5425 3.7146 3.2965 7.3390 7.9211 6.2418 6.6882 6.9543 1.0902 1.0898 1.0893 1.0952 1.0923 1.0893 1.0997 1.0969
irintensity: 0.0913 0.6469 1.8900 0.8770 5.4657 1.1339 3.1217 1.0584 0.3448 2.4264 0.1082 0.5868 11.0363 0.3548 0.2022 1.8752 9.8359 0.0079 2.1661 2.3491 9.2316 26.5384 0.1542 16.4223 59.7953 26.9942 1.1769 0.3758 36.2495 12.6781 0.1102 0.1084 1.8511 34.4998 15.8189 0.2121 0.0015 4.6592 37.9971 0.4915 28.4887 1.3175 142.0273 409.6569 1.9094 3.6333 3.3026 13.3355 36.0990 17.8125 78.9289 2.1235 24.8560 10.3798 12.1481 8.6156 38.3156 2.0868 0.1988 103.4805 9.3415 0.3659 6.4417 9.5464 20.0684 0.6833 4.7503 25.8326 2.6344
temp: 298.150 k
press: 1.00000 atm
elementType: 8 8 7 7 6 6 6 6 6 6 6 6 6 6 6 6 6 1 1 1 1 1 1 1 1
symmnumber: 1
zpe: 472853.8 jmol-1
zpe.correction: 0.180101 hartree
zpe.thermalcorrener: 0.192289 hartree
zpe.thermalcorrenthalpy: 0.193233 hartree
zpe.thermalcorrgfe: 0.141031 hartree
zpe.sumelectzpe: -758.916574 hartree
zpe.sumelectthermal: -758.904386 hartree
zpe.sumelectthermalent: -758.903442 hartree
zpe.sumelectthermalfe: -758.955644 hartree
dipole: -6.2718 -0.8618 0.0004
dipole: 6.3308
quadrupole: -108.1582 -90.6371 -100.2007
quadrupole: 10.0446 0.0034 0.0010
quadrupole: -8.4929 9.0283 -0.5353 10.0446 0.0034 0.0010
hfenergy: -759.0966748 hartree
pointgroup: C01 [X(C13H8N2O2)]
dipole: -2.4677602 -0.3373733 0.0001579 debye
dipolederiv: -1.0455053 -0.2048051 0.0000391 -0.2189166 -0.5592848 -0.0000327 0.000091 -0.0000025 -0.2283998 -0.7468864 0.1448774 0.0000661 0.5055279 -0.7505479 -0.0000794 0.0001572 -0.0001087 -0.2287917 -0.7756269 -0.0811632 0.0000179 -0.0347609 -0.2529051 0.0000004 0.000018 0.0000035 -0.2470317 2.3153896 -0.0231845 -0.0001956 -0.48463 1.0787242 0.0001322 -0.0003292 0.0001181 0.1865498 -0.4755319 0.0654975 0.0000466 -0.0204357 -0.2244101 -0.0000479 0.0000383 -0.0000531 0.0594909 -0.1958934 0.0915054 0.00003 0.3153415 -0.215701 -0.000068 0.0000624 -0.0000535 0.0734789 0.5825388 0.0214236 -0.0000279 -0.0302231 0.0810392 0.0000037 -0.0000441 0.0000012 0.0736719 0.6231321 0.1460044 -0.0000055 -0.1737278 0.0656075 0.0000052 -0.0000561 -0.0000089 0.0804349 0.4087527 -0.050096 -0.000038 0.1046427 0.2089489 0.0000525 -0.0000121 0.0000546 -0.1323133 0.6493708 -0.0659711 -0.0000536 0.1293914 -0.0449748 -0.0000037 -0.0000415 0.0000241 -0.1085599 -0.2938092 -0.0505488 0.0000058 0.0376336 0.1619629 0.0000476 0.0000212 0.0000452 -0.1366407 -1.12794 0.0013913 0.0000933 -0.0250684 0.093134 0.0000114 0.0000894 0.0000064 0.0614351 -0.0089843 -0.0613923 -0.0000181 0.1218747 0.125112 0.0000438 0.0000148 0.000052 -0.1603487 0.0165826 0.1064477 0.0000042 -0.2000377 0.0100617 0.0000379 -0.0000583 0.0000139 -0.1330102 -0.3725949 -0.0959047 -0.0000028 -0.1344981 0.104495 0.0000553 -0.0000099 0.0000503 -0.1618753 -0.015834 0.1712457 0.0000228 0.1594517 0.028286 0.0000214 0.0000216 0.0000213 -0.1478309 0.1420765 -0.1193339 -0.0000365 -0.0603839 0.0829407 0.0000402 -0.0000284 0.0000449 -0.1345727 0.0661719 0.02018 0.0000067 0.0165091 -0.054338 -0.0000348 0.0000096 -0.0000315 0.1413411 0.1059595 -0.0078281 0. 0.0188698 0.0329188 -0.0000243 0.0000053 -0.0000266 0.1699052 0.0816679 0.0487036 0.0000133 -0.0090972 -0.021722 -0.0000285 0.0000067 -0.0000268 0.1547501 0.0713507 0.0588854 0.0000148 -0.0384416 -0.0899768 -0.0000416 -0.0000026 -0.0000463 0.1600286 0.0766086 -0.0748535 -0.0000056 -0.0054411 0.0943445 -0.0000132 0.0000121 -0.0000041 0.1748624 0.0863654 -0.0169217 0.0000006 0.0591855 -0.0353487 -0.0000376 0.0000133 -0.0000331 0.1620617 -0.0653258 -0.0991128 -0.0000051 -0.1082116 0.0198328 -0.0000191 -0.0000061 -0.0000193 0.1627334 -0.1020352 0.0749537 0.0000275 0.075446 0.061801 -0.0000209 0.0000273 -0.0000213 0.158631 unknown
polarizability: 352.0651588|12.1989695|164.9276382|-0.0163503|0.0168793|59.2106054 unknown
InChI: InChI=1S/C13H8N2O2/c16-15(17)11-5-6-13-10(8-11)7-9-3-1-2-4-12(9)14-13/h1-8H
charge 0 multiplicity 1
25 atoms
O  5.092518 0.39449 -0.000388
O  4.341369 -1.761615 -0.00057
N  -1.164679 1.51871 0.000355
N  4.145473 -0.484075 -0.000327
C  0.357689 -0.448085 -0.000075
C  -2.069187 -0.804522 -0.000008
C  0.097805 0.992568 0.000194
C  -2.228723 0.650164 0.000262
C  -0.754535 -1.326165 -0.000175
C  1.711424 -0.916276 -0.000197
C  1.217681 1.900102 0.000293
C  2.7472 0.011559 -0.000118
C  -3.242887 -1.637212 -0.00009
C  2.522644 1.429059 0.000126
C  -3.556885 1.200807 0.000423
C  -4.511942 -1.067294 0.000077
C  -4.668557 0.362805 0.000336
H  -0.594355 -2.41125 -0.000368
H  1.942083 -1.986071 -0.000387
H  0.994226 2.970668 0.000475
H  -3.120787 -2.726611 -0.000287
H  3.385076 2.099743 0.000156
H  -3.650964 2.290711 0.000616
H  -5.402088 -1.704978 0.000013
H  -5.676798 0.790572 0.000467
