program: Gaussian 09
title: 000298509
version: EM64L-G09RevD.01
frameworkgroup: C1[X(C18H15NO)]
method: RPBEPBE
basis: SDD
operation: Freq
keyword: #p
keyword: freq=noraman
keyword: PBEPBE/SDD
title: #p freq=noraman PBEPBE/SDD
converged: YES YES NO NO
title: Mulliken charges:
elementType: O N C C C C C C C C C C C C C C C C C C H H H H H H H H H H H H H H H
charge: -0.469336 -0.008498 -0.089352 0.358581 0.314551 0.372153 -0.373878 -0.346073 -0.390196 -0.393418 -0.323001 -0.487872 -0.245124 -0.247567 -0.247133 -0.223114 -0.178894 -0.239742 -0.241463 -0.358720 0.262277 0.243400 0.262988 0.290334 0.285213 0.353659 0.273010 0.229907 0.227630 0.231769 0.225896 0.228832 0.232778 0.227576 0.242824
chargesum: 0.00000
title: Mulliken charges with hydrogens summed into heavy atoms:
elementType: O N C C C C C C C C C C C C C C C C C C
charge: -0.115677 -0.008498 -0.089352 0.358581 0.314551 0.372153 -0.111600 -0.102672 -0.127208 -0.103083 -0.037787 -0.214862 -0.015216 -0.019937 -0.015364 0.002782 0.049939 -0.006964 -0.013887 -0.115896
polarizability: 2.04038691e+02 2.47921732e+00 2.19056197e+02 1.11194529e+01 6.74586871e-01 1.53671928e+02
1716.lowfreq: -9.1729 -8.1089 0.0004 0.0007 0.0008 9.1184 14.5380 40.6823 51.8930
frequency: 13.7271 40.6746 51.8813 65.4988 80.7438 86.3519 192.8996 208.2089 234.1328 248.1808 266.3471 273.9964 301.9374 322.9269 348.2638 395.4154 401.5494 405.3974 440.5680 486.8387 526.8139 574.0881 608.7994 615.7922 616.3264 630.7729 650.0030 703.2052 705.6019 707.3118 728.5158 765.2945 774.4227 811.4433 855.2658 859.9446 882.7036 896.8150 924.2731 936.4138 940.9074 953.2462 954.4911 982.2348 984.9286 990.3737 990.6226 996.2876 1000.0097 1001.3771 1008.6725 1026.6233 1029.0154 1031.0893 1084.1877 1087.0184 1111.5230 1147.8290 1163.0177 1172.1484 1174.5934 1191.0649 1193.3666 1194.7031 1218.9968 1291.9453 1306.0768 1319.7543 1322.6466 1332.5737 1377.0784 1380.9723 1404.8637 1433.5015 1436.1846 1455.0028 1479.6212 1480.9927 1552.4165 1578.8816 1588.1055 1591.7846 1608.9410 1611.3300 3117.4867 3123.4050 3125.4106 3129.6803 3130.1580 3132.5609 3142.2764 3145.2240 3151.5164 3155.4744 3160.8463 3167.2332 3170.9379 3183.1866 3553.5493
redmass: 3.9658 4.0300 4.4312 4.9782 4.9975 4.7847 4.6512 3.9245 3.4859 1.3073 4.1357 5.6879 5.5245 4.4613 5.3077 3.0177 2.8635 2.8756 5.0469 3.8306 4.1712 4.4433 7.7976 6.3735 6.4100 5.5847 6.2376 3.3111 1.9259 2.0841 1.9754 1.9330 1.9702 1.7996 1.2532 1.2532 2.9709 3.5756 1.6933 1.3339 1.7672 2.9225 1.7778 1.3968 1.3798 6.0349 6.0623 1.4097 1.3251 1.3253 3.6938 2.6799 2.1968 2.4925 1.6095 1.5909 1.6004 2.1341 2.4795 1.0683 1.0518 1.1837 1.4565 1.1266 2.5549 1.7967 9.5703 1.3300 1.4024 1.2901 7.5826 8.9269 2.0243 2.2082 2.2368 2.0395 2.1902 2.2187 5.6662 6.0071 6.0640 6.3060 5.9941 6.0476 1.0872 1.0846 1.0896 1.0868 1.0895 1.0885 1.0922 1.0940 1.0924 1.0951 1.0995 1.1007 1.0987 1.0946 1.0662
irintensity: 0.1861 0.4957 1.3658 0.8761 1.0281 0.8058 0.3224 5.8184 40.1701 93.0100 0.9476 0.5179 9.5108 18.0860 2.4659 1.5005 0.8650 0.9538 3.4496 6.5313 4.6341 5.5047 3.2608 0.1713 0.0560 21.1132 12.9968 15.6226 62.9536 32.4551 40.4237 47.0095 54.3593 44.8340 0.2123 0.2494 19.4337 18.9506 14.4563 1.5609 3.2040 22.8121 13.8478 0.2710 0.3114 0.5515 1.2479 0.2661 0.1750 0.4656 1.5887 2.8233 15.0922 1.2316 4.1838 2.2956 5.3134 41.0578 9.6854 1.1346 0.1156 4.8659 0.2475 5.6104 20.7159 53.0147 0.5726 15.7591 2.0719 12.3166 1.2773 0.6908 30.9975 19.1094 10.1762 21.9651 9.9643 26.0549 7.8587 1.0562 0.4668 0.3497 5.9855 3.3154 9.5978 1.5231 28.1295 0.6517 4.1183 7.8612 18.0428 33.9736 20.5376 22.2894 24.9160 22.0904 14.6833 6.5560 8.6240
temp: 298.150 k
press: 1.00000 atm
elementType: 8 7 6 6 6 6 6 6 6 6 6 6 6 6 6 6 6 6 6 6 1 1 1 1 1 1 1 1 1 1 1 1 1 1 1
symmnumber: 1
zpe: 726188.8 jmol-1
zpe.correction: 0.276591 hartree
zpe.thermalcorrener: 0.293015 hartree
zpe.thermalcorrenthalpy: 0.293960 hartree
zpe.thermalcorrgfe: 0.230826 hartree
zpe.sumelectzpe: -823.492776 hartree
zpe.sumelectthermal: -823.476351 hartree
zpe.sumelectthermalent: -823.475407 hartree
zpe.sumelectthermalfe: -823.538540 hartree
dipole: -1.0917 0.6563 1.4043
dipole: 1.8960
quadrupole: -104.6001 -110.9777 -117.2671
quadrupole: 0.9363 2.3492 -10.3702
quadrupole: 6.3482 -0.0294 -6.3188 0.9363 2.3492 -10.3702
hfenergy: -823.7693663 hartree
pointgroup: C01 [X(C18H15N1O1)]
dipole: -0.4604166 -0.0557609 -0.5842189 debye
polarizability: 204.3334734|2.5610578|216.480184|-8.8033011|13.9214509|155.953158 unknown
InChI: InChI=1S/C18H15NO/c20-18(15-8-3-1-4-9-15,16-10-5-2-6-11-16)17-12-7-13-19-14-17/h1-14,20H
charge 0 multiplicity 1
35 atoms
O  -0.032413 0.361704 -2.141223
N  1.779302 2.410331 1.914961
C  -0.060966 0.169114 -0.659663
C  -1.511456 0.430921 -0.194419
C  0.395417 -1.286323 -0.419727
C  0.967964 1.129691 -0.021648
C  -2.423748 -0.629123 0.029224
C  0.644633 -1.747587 0.897882
C  -1.989057 1.768039 -0.115977
C  0.55054 -2.182717 -1.503057
C  2.128166 1.494415 -0.748476
C  0.848394 1.616037 1.305713
C  -3.777222 -0.361772 0.332286
C  1.04101 -3.082455 1.127247
C  -3.342195 2.036431 0.182408
C  0.95437 -3.518662 -1.273437
C  3.098805 2.316058 -0.13819
C  -4.243108 0.970332 0.409296
C  1.199969 -3.975015 0.040884
C  2.886805 2.74821 1.191533
H  -2.074756 -1.664413 -0.0332
H  0.532382 -1.068302 1.750086
H  -1.297909 2.605762 -0.27101
H  0.35404 -1.820681 -2.514852
H  2.2475 1.13324 -1.774347
H  -0.587506 1.155891 -2.351653
H  -0.031734 1.377193 1.914054
H  -4.468007 -1.19427 0.5063
H  1.229543 -3.423568 2.151351
H  -3.690218 3.073492 0.244169
H  1.074444 -4.20124 -2.122502
H  4.004455 2.614814 -0.675904
H  -5.29301 1.17582 0.645747
H  1.512764 -5.010158 0.218445
H  3.617601 3.384392 1.703999
