program: Gaussian 09
title: 000298467
version: EM64L-G09RevD.01
frameworkgroup: C1[X(C7H7ClN2O)]
method: RPBEPBE
basis: SDD
operation: Freq
keyword: #p
keyword: freq=noraman
keyword: PBEPBE/SDD
title: #p freq=noraman PBEPBE/SDD
converged: NO NO NO NO
title: Mulliken charges:
elementType: Cl O N N C C C C C C C H H H H H H H
charge: -0.028375 -0.239345 -0.443399 0.086095 0.489411 -0.331416 -0.443820 0.214532 -0.099277 -0.290781 -0.795585 0.310598 0.234667 0.323980 0.259541 0.239513 0.274103 0.239556
chargesum: 0.00000
title: Mulliken charges with hydrogens summed into heavy atoms:
elementType: Cl O N N C C C C C C C
charge: -0.028375 -0.239345 -0.132800 0.086095 0.489411 -0.096749 -0.119840 0.214532 0.160265 -0.290781 -0.042413
polarizability: 1.74029761e+02 -1.12109860e+00 9.63267006e+01 8.03464619e-04 1.88470328e-05 4.47303026e+01
1716.lowfreq: -55.2201 -6.8263 -0.0019 -0.0015 0.0013 2.2249 20.8456 59.4666 71.2023
frequency: -55.0682 59.4622 71.1180 135.1570 146.6378 256.6455 284.8996 338.7719 364.6465 416.4470 420.2534 516.4859 562.1087 586.0691 610.7577 637.9509 696.6519 739.6197 819.5441 827.1388 927.5118 940.8813 951.0739 972.5048 994.0493 1033.1906 1087.8665 1147.3682 1217.9351 1257.8807 1272.0690 1326.8980 1353.0922 1377.1112 1442.3742 1452.8835 1467.7870 1489.1695 1559.8024 1586.2852 1636.5368 2986.9657 3072.4314 3124.7054 3137.8195 3176.9202 3205.6112 3513.9556
redmass: 1.0788 5.3712 5.1074 6.4564 4.8429 10.2565 4.9805 4.7653 5.5471 3.4877 5.9997 3.1429 4.7652 3.0037 8.1672 1.1985 6.2842 4.3709 5.7686 1.5002 6.6823 1.3776 1.3586 2.2629 2.1500 1.6641 3.3326 1.4053 3.1734 2.0649 1.5092 6.7304 2.7480 1.2353 1.3795 1.8199 1.0466 2.2317 4.0236 5.9623 5.1548 1.0384 1.0985 1.0912 1.0980 1.0965 1.0940 1.0766
irintensity: 0.0021 0.0140 4.0496 2.6564 0.0002 0.6709 4.0260 0.0055 1.2304 5.7469 31.2973 16.7544 0.0748 0.2062 4.1290 69.9460 28.2063 5.0023 7.3447 59.3210 3.3527 15.1916 3.3882 25.6949 20.3823 8.1292 85.6148 40.4110 56.4475 16.7752 8.1360 66.6559 115.9939 52.9281 39.4265 289.9030 20.9672 337.3420 51.9097 8.0386 135.2333 6.8564 13.5477 12.3459 5.8676 2.7600 2.7568 11.1812
temp: 298.150 k
press: 1.00000 atm
elementType: 17 8 7 7 6 6 6 6 6 6 6 1 1 1 1 1 1 1
symmnumber: 1
zpe: 342150.2 jmol-1
zpe.correction: 0.130318 hartree
zpe.thermalcorrener: 0.139907 hartree
zpe.thermalcorrenthalpy: 0.140851 hartree
zpe.thermalcorrgfe: 0.094267 hartree
zpe.sumelectzpe: -914.942201 hartree
zpe.sumelectthermal: -914.932612 hartree
zpe.sumelectthermalent: -914.931668 hartree
zpe.sumelectthermalfe: -914.978252 hartree
dipole: 4.0479 6.4059 0.0002
dipole: 7.5777
quadrupole: -69.0702 -70.0312 -72.4480
quadrupole: 5.8096 0.0013 -0.0003
quadrupole: 1.4463 0.4853 -1.9316 5.8096 0.0013 -0.0003
hfenergy: -915.0725188 hartree
pointgroup: C01 [X(C7H7Cl1N2O1)]
dipole: 1.4892098 -2.5826793 0.0080469 debye
dipolederiv: -1.0435846 0.0916947 0.0000199 0.1813597 -0.1343796 0.0001127 -0.000276 0.0001415 -0.0826435 -0.6566663 0.060523 -0.0000835 -0.520412 -0.9135984 0.0020856 0.0018579 0.0018956 -0.3304624 -1.9118712 -0.2589338 0.0013982 -0.3902456 -0.3802234 0.0002974 0.001829 0.0002311 -0.3337078 -0.6571381 0.1316401 -0.000274 -0.3648747 -0.3546731 0.0007732 0.0013948 0.0006009 -0.1629794 1.1838434 -0.0178819 -0.0002959 -0.4836727 -0.1715882 0.0012553 0.0012618 0.0011042 0.1546322 -0.0693795 0.036262 -0.0001549 -0.0804204 0.1295664 -0.0009981 0.0002351 -0.0010419 -0.1734787 0.0157777 -0.1311465 0.0004078 0.383885 0.2250949 -0.0012066 -0.0013091 -0.001026 -0.0929779 1.81423 0.1606603 -0.0011248 0.9434033 1.2162047 -0.0037234 -0.0038266 -0.0034508 0.1752878 -0.3444164 0.040064 -0.0000382 0.3019101 -0.0037129 -0.0003093 -0.0009277 -0.0002188 -0.06488 1.6394348 -0.1696874 0.0000031 -0.1736512 0.2457392 -0.0008379 0.0000138 -0.0008363 -0.0202038 -0.4220918 0.124644 -0.0002353 0.2521122 -0.1078733 0.0003906 -0.0004788 0.0004041 0.0559732 0.1438949 -0.0171953 0.0001123 0.0334498 0.0877131 0.000723 -0.0000529 0.00075 0.3087487 0.0287554 0.1010775 -0.0002966 0.0823738 -0.0524122 0.0006983 -0.0002303 0.0006936 0.1621207 0.125482 -0.0324267 0.0001198 -0.0404565 0.0983024 0.0002142 0.000149 0.0002074 0.1571898 0.0312965 -0.0726717 0.0002908 -0.0749648 0.0180649 0.000525 0.0002991 0.0005237 0.1660218 0.0583797 0.0006801 0.0284697 0.0325337 0.0381643 0.1051342 -0.0221166 0.1078823 -0.0270555 0.0056941 -0.0477991 0.0001523 -0.114954 0.0226402 0.0003398 0.0003124 0.000346 0.1342149 0.0583595 0.0004966 -0.0284707 0.0326242 0.0369711 -0.1054739 0.0218653 -0.1082066 -0.0258 unknown
polarizability: 173.9930795|-2.0261064|96.3627927|-0.037996|-0.1720769|44.7308916 unknown
InChI: InChI=1S/C7H7ClN2O/c1-5(11)10-6-2-3-7(8)9-4-6/h2-4,10H,1H3
charge 0 multiplicity 1
18 atoms
Cl -4.263346 0.507591 -0.00132
O  2.569916 1.445588 -0.006681
N  1.619708 -0.70065 0.000728
N  -1.631822 1.168589 -0.004449
C  0.235433 -0.398618 0.000203
C  -0.690816 -1.480041 0.00417
C  -0.290094 0.926848 -0.00409
C  2.706432 0.189606 -0.002587
C  -2.073026 -1.222123 0.003767
C  -2.477116 0.131127 -0.000668
C  4.066846 -0.507496 -0.000812
H  1.857206 -1.696298 0.003946
H  -0.33623 -2.518359 0.007568
H  0.374267 1.791346 -0.007226
H  -2.805042 -2.033696 0.006756
H  4.190476 -1.141195 0.897184
H  4.854152 0.259481 -0.003156
H  4.190154 -1.146302 -0.89523
