program: Gaussian 09
title: 000298478
version: EM64L-G09RevD.01
frameworkgroup: C1[X(C14H16N4)]
method: RPBEPBE
basis: SDD
operation: Freq
keyword: #pfreq=noraman
keyword: PBEPBE/SDD
title: #p freq=noraman PBEPBE/SDD
converged: YES YES NO NO
title: Mulliken charges:
elementType: N N N N C C C C C C C C C C C C C C H H H H H H H H H H H H H H H H
charge: -0.147367 -0.102232 -0.118754 -0.009419 0.415041 -0.330521 -0.312565 0.145757 -0.362792 -0.302827 -0.644290 -0.645483 0.346294 0.074004 -0.790860 -0.245829 -0.483686 -0.336469 0.242214 0.239764 0.248339 0.271081 0.241442 0.221410 0.241936 0.221601 0.242013 0.241549 0.240343 0.240266 0.212534 0.266669 0.244578 0.236257
chargesum: 0.00000
title: Mulliken charges with hydrogens summed into heavy atoms:
elementType: N N N N C C C C C C C C C C C C C C
charge: -0.147367 -0.102232 -0.118754 -0.009419 0.415041 -0.088307 -0.072801 0.145757 -0.114453 -0.031747 0.060498 0.059681 0.346294 0.074004 -0.097717 0.020841 -0.239108 -0.100213
polarizability: 4.83583351e+02 -3.09188938e+00 1.80699742e+02 -6.10141305e-02 8.53488020e-02 8.45233034e+01
1716.lowfreq: -7.3946 -5.1234 -2.5498 -0.0004 0.0006 0.0007 15.4819 36.3076 55.7826
frequency: 14.5110 36.2764 55.7783 68.7887 89.0039 102.5864 127.3120 154.3617 167.9944 189.1709 195.7140 197.5596 251.6969 261.7649 284.8507 357.2566 384.8821 412.7810 431.7951 439.2205 464.6214 496.0115 521.5270 531.4585 571.7695 576.2167 623.7845 631.4485 714.5365 740.5262 758.6144 781.3413 806.5001 833.2627 833.8717 849.6001 899.2513 916.8258 938.5637 964.8894 975.9088 984.5086 986.7369 993.7077 1027.3491 1044.3556 1053.7587 1102.1817 1111.2126 1120.9804 1135.8758 1161.7303 1170.5966 1187.2867 1214.2989 1253.0648 1256.4566 1296.0814 1307.1437 1312.8604 1335.0994 1365.7471 1380.7542 1397.7612 1403.0768 1429.8265 1449.9455 1455.2863 1456.8480 1460.0842 1465.0689 1470.6560 1478.0926 1491.9106 1499.6626 1520.7824 1548.6345 1553.6940 1562.1649 1625.8667 2952.2030 2958.9306 2988.1409 3022.7405 3025.6158 3073.3387 3088.6246 3102.6956 3113.5088 3114.7720 3131.4443 3148.0944 3151.2444 3170.9383 3174.7890 3176.7640
redmass: 3.4010 4.7648 4.7384 2.2769 2.7427 1.2739 1.7080 2.2432 4.5080 1.9014 4.1830 1.6781 3.4442 3.4101 4.5208 3.5616 4.5374 3.7898 2.9257 3.2798 3.7794 4.5061 2.5379 4.6700 5.5903 3.5474 6.4703 7.1857 5.1316 3.7886 3.7498 5.7957 1.2636 5.9280 1.7380 1.3746 7.2767 1.3308 3.0430 1.3548 1.4108 1.3320 2.8627 1.5151 2.1401 1.5604 1.5166 1.2369 1.3315 1.5086 2.9738 1.6077 1.5314 1.8471 2.4287 3.0981 3.0292 2.0817 1.7218 3.5687 3.9664 3.0297 4.6323 1.4620 1.6274 1.1797 2.0543 1.4060 1.0469 2.6123 1.0403 1.1403 1.0456 1.1492 1.3347 2.0179 6.2161 6.3454 5.8273 6.2638 1.0364 1.0389 1.0358 1.0997 1.1028 1.0970 1.1005 1.0972 1.0950 1.0909 1.0902 1.0884 1.0866 1.0955 1.0947 1.0952
irintensity: 0.0007 0.5822 0.3580 0.0007 2.6874 0.0211 2.5459 0.6411 0.5673 2.3630 0.4348 1.9339 2.8405 1.8563 5.5624 0.9645 0.0869 7.1097 0.9207 1.0559 3.6478 36.8355 10.3043 3.2771 2.5953 19.1585 10.9104 1.7702 0.4410 1.6740 0.5645 0.2718 2.6853 19.5352 52.6139 66.7129 0.2050 0.0576 37.7693 1.4337 0.6297 0.8613 0.3540 21.3986 9.0684 9.9775 25.8674 0.1302 0.9735 12.8585 141.5179 9.1881 84.1378 46.9948 0.0277 18.5833 5.1472 12.6424 173.6160 69.1535 496.7770 171.2584 10.5084 33.8944 2.4095 6.4421 14.3717 24.1207 12.2464 3.1501 0.2016 18.5979 24.6768 0.6362 17.5569 187.5312 59.6176 12.6057 75.1473 552.2849 83.8782 175.9167 30.1620 4.1068 68.2638 15.3933 26.7251 3.7242 46.7321 48.7368 29.8691 3.8829 2.8270 17.7273 12.1005 20.3329
temp: 298.150 k
press: 1.00000 atm
elementType: 7 7 7 7 6 6 6 6 6 6 6 6 6 6 6 6 6 6 1 1 1 1 1 1 1 1 1 1 1 1 1 1 1 1
symmnumber: 1
zpe: 718470.1 jmol-1
zpe.correction: 0.273651 hartree
zpe.thermalcorrener: 0.290902 hartree
zpe.thermalcorrenthalpy: 0.291846 hartree
zpe.thermalcorrgfe: 0.226730 hartree
zpe.sumelectzpe: -760.748190 hartree
zpe.sumelectthermal: -760.730939 hartree
zpe.sumelectthermalent: -760.729995 hartree
zpe.sumelectthermalfe: -760.795111 hartree
dipole: -9.7886 1.4028 -0.0052
dipole: 9.8886
quadrupole: -94.5327 -93.6387 -111.2688
quadrupole: 4.6008 0.1288 -0.0298
quadrupole: 5.2807 6.1747 -11.4554 4.6008 0.1288 -0.0298
hfenergy: -761.0218408 hartree
pointgroup: C01 [X(C14H16N4)]
dipole: 3.8640799 -0.4333822 -0.1294036 debye
polarizability: 483.1387949|6.2596709|180.7390856|-11.8016549|2.1324378|84.9285164 unknown
InChI: InChI=1S/C14H16N4/c1-11-10-15-9-8-14(11)17-16-12-4-6-13(7-5-12)18(2)3/h4-10H,1-3H3
charge 0 multiplicity 1
34 atoms
N  5.048412 -0.031941 -0.18405
N  -0.570203 0.713125 0.014821
N  -1.355532 -0.344757 0.006322
N  -5.567828 0.427224 0.140172
C  3.666345 0.124568 -0.134372
C  3.067683 1.427959 -0.072439
C  2.789959 -1.018258 -0.144366
C  0.814918 0.436574 -0.035334
C  1.675984 1.570017 -0.024415
C  1.402981 -0.864292 -0.096015
C  5.925662 1.148789 -0.163656
C  5.64361 -1.375487 -0.259168
C  -3.656254 -1.134734 0.061566
C  -2.751732 -0.027967 0.05364
C  -3.175064 -2.569153 0.025623
C  -3.281416 1.292839 0.089465
C  -5.041361 -0.832104 0.10538
C  -4.6760 1.468111 0.131595
H  3.692347 2.324606 -0.063573
H  3.20832 -2.027616 -0.18969
H  1.215644 2.562764 0.022031
H  0.739245 -1.734666 -0.103765
H  5.743962 1.808043 -1.035666
H  6.977155 0.82495 -0.195405
H  5.780098 1.747854 0.7569
H  6.739818 -1.287177 -0.306197
H  5.306752 -1.921338 -1.162442
H  5.388384 -1.987513 0.628619
H  -2.571231 -2.763958 -0.878481
H  -2.524626 -2.792861 0.889871
H  -4.029977 -3.267698 0.037081
H  -2.596004 2.144499 0.083239
H  -5.772354 -1.65053 0.112764
H  -5.115197 2.471925 0.159644
