program: Gaussian 09
title: 000298466
version: EM64L-G09RevD.01
frameworkgroup: C1[X(C11H10N2O2)]
method: RPBEPBE
basis: SDD
operation: Freq
keyword: #p
keyword: freq=noraman
keyword: PBEPBE/SDD
title: #p freq=noraman PBEPBE/SDD
converged: YES YES NO NO
title: Mulliken charges:
elementType: O O N N C C C C C C C C C C C H H H H H H H H H H
charge: -0.323161 -0.208374 -0.037143 -0.530142 0.075513 0.292248 0.397060 -0.380818 -0.410620 0.057384 -0.355414 -0.232836 -0.271171 -0.159162 -0.468418 0.264758 0.243288 0.253500 0.239202 0.281379 0.236729 0.239030 0.225010 0.282725 0.289434
chargesum: 0.00000
title: Mulliken charges with hydrogens summed into heavy atoms:
elementType: O O N N C C C C C C C C C C C
charge: -0.323161 -0.208374 -0.037143 0.042017 0.075513 0.292248 0.397060 -0.116060 -0.167333 0.057384 -0.101914 0.006366 0.010208 0.077567 -0.004379
polarizability: 2.01928488e+02 -5.51387011e-01 1.74042142e+02 -8.91512584e+00 -1.84149331e+00 7.17471954e+01
1716.lowfreq: -13.7657 -6.5804 0.0006 0.0007 0.0010 7.0355 35.7542 60.8231 83.4725
frequency: 35.7415 60.8087 83.4679 141.5339 169.4324 207.3000 245.6704 256.3388 283.5405 292.9138 321.5766 350.9503 467.6069 469.3654 480.7956 519.7395 536.3158 557.3452 588.4815 614.9628 637.3032 714.5863 746.9725 767.0520 770.7131 788.5161 811.9764 825.2108 870.2753 877.7128 904.9560 929.7853 962.0458 988.7136 1035.2601 1037.4228 1076.8069 1121.4645 1127.1489 1147.4459 1176.0852 1182.2138 1214.9570 1238.0757 1259.6111 1308.4765 1314.9932 1340.6676 1383.4642 1408.9479 1410.8989 1428.4398 1443.7298 1519.0946 1553.9612 1585.8675 1591.3127 1609.6681 1654.8954 2958.8205 3069.7280 3136.2944 3150.2167 3155.4967 3168.1002 3177.5397 3211.8180 3427.7213 3546.1785
redmass: 6.1181 3.6876 4.5790 5.8587 4.6370 3.2258 3.8851 2.6525 4.5371 2.3064 2.3126 5.8358 3.6774 4.9626 4.6243 4.6139 5.6933 3.6018 7.3833 4.0541 3.2327 2.8089 2.4596 2.4513 1.4830 5.1621 2.5248 2.3710 1.5316 1.4347 2.2695 2.2795 1.3286 1.3630 3.5250 3.2785 1.9382 2.6727 1.6732 1.5078 1.3765 1.3857 2.7507 2.6943 2.0347 1.4198 2.5410 1.2527 2.6626 2.0539 7.2538 1.1060 2.4213 4.4112 5.3700 6.9919 9.4328 6.9702 1.0819 1.0673 1.0934 1.0868 1.0922 1.0885 1.0993 1.0960 1.0961 1.0452 1.0951
irintensity: 0.2612 1.0637 0.6142 1.8282 4.0893 1.8825 14.2962 19.5028 28.4325 41.4984 11.1062 5.4997 1.2601 6.1322 2.6892 3.3711 1.4704 2.6283 2.8902 2.2798 0.4651 91.1479 17.5692 150.9664 49.6515 4.6252 119.2902 162.7109 21.6515 1.7271 5.3717 8.4228 1.0498 1.3108 5.1845 1.5280 1.4564 4.5510 5.2115 10.1741 4.5965 28.4904 73.1412 16.8806 3.9180 6.7571 6.9190 4.3423 25.3922 12.8240 5.5548 12.5915 8.3321 13.8888 12.6183 21.7132 136.9618 2.3105 49.7983 22.9881 23.6734 1.1564 7.4235 1.2504 17.3111 11.5851 0.0503 4.0905 3.1645
temp: 298.150 k
press: 1.00000 atm
elementType: 8 8 7 7 6 6 6 6 6 6 6 6 6 6 6 1 1 1 1 1 1 1 1 1 1
symmnumber: 1
zpe: 499157.0 jmol-1
zpe.correction: 0.190119 hartree
zpe.thermalcorrener: 0.202827 hartree
zpe.thermalcorrenthalpy: 0.203772 hartree
zpe.thermalcorrgfe: 0.150609 hartree
zpe.sumelectzpe: -684.004495 hartree
zpe.sumelectthermal: -683.991786 hartree
zpe.sumelectthermalent: -683.990842 hartree
zpe.sumelectthermalfe: -684.044005 hartree
dipole: 6.3544 0.8554 -1.6617
dipole: 6.6235
quadrupole: -83.7916 -74.0826 -96.1772
quadrupole: -4.4154 -0.3140 -3.9576
quadrupole: 0.8922 10.6012 -11.4934 -4.4154 -0.3140 -3.9576
hfenergy: -684.1946137 hartree
pointgroup: C01 [X(C11H10N2O2)]
dipole: 2.4741443 -0.577579 0.5794375 debye
dipolederiv: -1.1273041 0.1795989 -0.0791849 0.1200979 -0.5221326 0.0160008 -0.0570788 0.0397372 -0.2814572 -0.7807782 -0.0686786 -0.1974313 -0.1242464 -0.3216692 -0.1077401 -0.2591853 -0.1516595 -0.7285753 0.9527081 -0.3145447 0.1124578 -0.3928799 0.1425052 -0.0474647 0.1465299 -0.0548612 0.0970728 -0.7461552 0.3089281 0.217338 0.3877246 -0.4146742 -0.1322138 0.4366955 -0.155939 -0.5347761 -0.0052907 0.2062769 0.0044504 0.3285261 -0.0538081 0.0373704 0.0083562 0.0051068 0.0203544 -0.1000698 -0.0136809 -0.0772543 -0.1436306 0.0005596 0.0298119 0.1449112 -0.0898275 -0.1157075 -0.0754498 0.0362603 -0.0151956 0.1350079 0.1696609 0.0066631 0.0016559 0.0255274 0.1113735 -0.0388072 0.0630518 0.0433068 0.2487313 -0.0883276 -0.0189004 -0.0426375 0.0688355 -0.1213829 -0.0036595 -0.0886094 0.0465733 -0.1558283 -0.0854242 -0.0054848 0.0107359 -0.0101661 -0.1755918 1.0056215 0.1262028 0.1623604 0.3452357 0.2488755 0.1934529 0.2742033 0.0983047 0.7459836 -0.0077166 -0.0234025 0.0170053 -0.0641336 -0.1072305 -0.0046329 0.0104165 0.0068065 -0.1821524 0.140152 -0.0882747 -0.0139761 -0.0601586 0.1801964 0.0123814 -0.0032805 0.0178896 -0.1009575 -0.234186 0.0786107 0.0023019 -0.2628294 0.1340352 -0.0297472 -0.0364783 0.0072084 -0.1317617 0.1487028 -0.0660416 0.0295147 0.0574627 0.0498415 0.0125726 0.0434816 -0.003999 -0.1074825 0.3114325 -0.1234779 0.0199406 -0.1999703 0.29136 -0.0075613 -0.197147 0.0327978 0.1114663 -0.0045782 -0.0771694 -0.0182702 -0.0455497 0.0548814 -0.0057112 0.0061773 -0.0234957 0.1369104 -0.0667624 0.0822805 -0.0217012 0.0171681 0.0631799 0.0003484 -0.0219704 -0.0006789 0.1538591 -0.0368277 0.02463 -0.0222047 0.0842056 0.0573244 0.0065443 -0.0282271 -0.0018738 0.1656189 0.0863726 0.0237965 -0.0056405 0.040372 -0.1089028 -0.0108914 0.0038434 -0.0098402 0.1534002 0.0759713 0.0438142 -0.0138652 0.0167241 0.0412206 0.0034181 -0.0198399 0.0078015 0.1827722 0.0028469 -0.0910249 -0.0178564 -0.0970328 0.0274236 -0.0112474 -0.0169883 -0.0148519 0.1619311 -0.0550878 -0.0183039 -0.1185276 -0.0167808 0.0452474 -0.0697759 -0.1219728 -0.0113067 0.0202321 0.0088266 -0.0296921 0.0587065 -0.037423 -0.1022744 0.0747403 0.0596484 0.0405189 0.0349542 0.3166159 -0.046999 -0.1124196 -0.0598993 0.1391072 -0.0400864 -0.2697287 -0.0010467 0.1664774 0.2334229 -0.1235511 -0.0004279 -0.1208935 0.1590246 0.0981532 -0.0721204 0.179012 0.2174386 unknown
polarizability: 202.0099395|-2.2354038|173.6939154|7.3471382|7.0082743|72.0139701 unknown
InChI: InChI=1S/C11H10N2O2/c12-7-10(14)9-5-1-3-8-4-2-6-13(15)11(8)9/h1-6H,7,12H2
charge 0 multiplicity 1
25 atoms
O  -0.874082 1.903839 -0.193781
O  -2.74165 -0.463436 -1.235809
N  0.358639 1.400867 -0.026033
N  -3.743148 1.16051 0.950035
C  0.530366 -0.011564 0.006567
C  -0.616054 -0.846034 -0.142168
C  1.857818 -0.555242 0.133144
C  -0.417542 -2.236233 -0.199667
C  2.002666 -1.97981 0.099416
C  -2.033036 -0.307019 -0.203464
C  2.973401 0.333998 0.27003
C  0.886119 -2.801588 -0.073909
C  1.443252 2.231956 0.102598
C  2.749364 1.713822 0.257787
C  -2.666732 0.182091 1.126276
H  -1.284659 -2.888619 -0.345495
H  3.005543 -2.410156 0.196362
H  3.98291 -0.074455 0.374282
H  1.00571 -3.889102 -0.116632
H  1.208672 3.296276 0.064188
H  3.573505 2.425403 0.356846
H  -1.889584 0.597457 1.788583
H  -3.071691 -0.722959 1.629515
H  -4.477243 0.809179 0.321753
H  -3.369941 2.049718 0.593273
