program: Gaussian 09
title: 000298541
version: EM64L-G09RevD.01
frameworkgroup: C1[X(C15H19N3O7)]
method: RPBEPBE
basis: SDD
operation: Freq
keyword: #p
keyword: freq=noraman
keyword: PBEPBE/SDD
title: #p freq=noraman PBEPBE/SDD
converged: YES YES NO NO
title: Mulliken charges:
elementType: O O O O O O O N N N C C C C C C C C C C C C C C C H H H H H H H H H H H H H H H H H H H
charge: -0.315532 -0.302002 -0.270219 -0.458541 -0.462413 -0.318685 -0.206906 -0.184518 -0.225248 -0.002627 -0.049495 -0.148630 -0.076119 -0.193150 -0.044845 -0.356750 0.348650 -0.688365 -0.697612 0.325269 -0.213770 0.180788 0.133124 -0.596603 -0.194895 0.254411 0.252067 0.232751 0.246230 0.285570 0.252964 0.222343 0.386124 0.397799 0.221616 0.238083 0.223349 0.240383 0.220356 0.217710 0.335427 0.257108 0.279969 0.254833
chargesum: 0.00000
title: Mulliken charges with hydrogens summed into heavy atoms:
elementType: O O O O O O O N N N C C C C C C C C C C C C C C C
charge: -0.315532 -0.302002 -0.270219 -0.072417 -0.064614 -0.318685 -0.206906 -0.184518 -0.225248 -0.002627 0.204916 0.103438 0.156632 0.053079 0.240726 0.118557 0.348650 -0.005318 -0.019162 0.325269 0.121657 0.180788 0.133124 0.195307 -0.194895
polarizability: 2.36744908e+02 -7.23455159e+00 2.48916946e+02 4.34127004e+00 1.28541472e+01 1.30574583e+02
1716.lowfreq: -3.3319 -1.4773 -0.0005 -0.0003 0.0004 10.4411 21.4259 26.5535 33.7553
frequency: 21.0282 26.4535 33.5977 52.1866 65.8806 81.4977 84.0211 88.3030 108.9566 115.3413 136.6507 149.5604 155.0250 177.1807 200.2526 206.6593 221.4782 232.3266 261.1885 265.6363 298.5884 311.1524 319.9626 335.9131 344.7473 357.1540 378.5916 388.8824 401.7619 431.4038 452.5955 459.1157 476.7356 499.5974 511.9812 526.7284 557.4452 580.5609 612.4158 626.1474 659.6136 693.5613 706.5129 714.1282 720.5425 731.3602 748.4061 756.1028 760.1404 777.7462 802.6113 866.9591 878.7675 912.9293 916.8359 937.2140 943.9965 954.4561 964.4886 982.9094 985.0523 998.2582 1006.0560 1031.6423 1035.5556 1054.0122 1067.9622 1090.4448 1113.1223 1129.1118 1129.5465 1142.3111 1181.3721 1184.5654 1205.6909 1221.6562 1227.6244 1250.3276 1258.4876 1260.6548 1262.0275 1272.2539 1274.5914 1299.1254 1312.6634 1317.4046 1325.2325 1333.5177 1351.5006 1365.0827 1377.6495 1379.0114 1386.0305 1391.5380 1398.6323 1434.9664 1449.4537 1453.4068 1468.6230 1471.6789 1472.7725 1476.3428 1481.2101 1571.8151 1622.7401 1639.1020 2191.7770 2982.7933 2991.2495 2994.9730 2998.2655 3005.9478 3015.4593 3017.8599 3018.5285 3027.9544 3096.2824 3101.3511 3107.9325 3113.1501 3119.6075 3141.0506 3146.1057 3187.7399 3349.1084 3448.0592
redmass: 5.4567 4.1124 4.6312 6.3617 6.0341 1.5286 2.3277 6.1495 5.4096 7.7359 6.3985 1.1398 3.8801 5.3214 2.6664 1.5489 4.0027 3.1017 5.0313 4.4859 6.1381 3.9393 4.2132 6.0544 3.1409 3.7675 9.8494 4.0702 2.8520 8.7302 5.1525 8.2507 3.6202 6.7497 1.2180 9.3479 5.0809 3.6991 4.7494 4.8625 5.1076 1.2996 4.0610 5.8672 6.6626 7.5454 4.2931 8.1246 5.3302 7.2330 4.9147 3.5771 3.2500 3.7615 1.7630 2.0342 2.6416 5.1897 1.3705 1.4088 4.8384 3.7898 2.9980 2.6572 7.8109 2.4324 4.3081 3.5448 3.6903 1.8083 1.3146 1.9861 1.1970 1.3371 2.5519 2.7584 1.1686 3.6659 1.7563 1.4585 1.4022 1.6248 1.6373 1.2092 1.5393 1.2731 1.6716 1.3891 1.9469 1.4438 1.9285 1.3101 1.6330 1.2359 2.3502 1.5069 1.0518 1.0495 1.0713 1.0605 1.0871 1.0425 1.0631 7.6681 7.5329 10.2054 12.6195 1.0844 1.0848 1.0352 1.0850 1.0356 1.0874 1.0331 1.0860 1.0658 1.0999 1.1005 1.0995 1.1026 1.1007 1.1010 1.1025 1.0945 1.0653 1.0645
irintensity: 0.1445 0.9489 0.8747 0.5722 1.5118 0.6180 0.9088 1.2624 0.9404 3.3528 7.2779 0.4591 6.2267 4.2210 1.4391 7.6361 4.5323 9.5791 1.0564 10.5059 8.5849 9.7242 3.7299 5.5668 7.5678 1.6351 16.4831 27.7654 2.3450 11.4461 3.9638 2.1213 12.8450 23.8056 159.8672 0.0644 9.8260 1.5111 2.0902 23.5934 7.5592 104.7685 24.5936 3.9287 39.3768 18.6439 38.5737 42.0378 23.1906 12.1520 19.0591 2.7395 34.7995 13.4943 0.7286 8.0795 17.1333 5.6159 15.3136 9.2419 49.6239 114.3756 27.9126 21.3699 212.2207 7.1031 129.2030 76.8389 72.0407 20.6964 0.0081 30.6974 24.6557 34.5725 65.6361 2.3184 47.9976 32.3970 70.6619 19.8099 37.3231 23.0371 47.6310 52.5156 20.5517 4.4439 58.3705 11.1968 33.1553 40.1222 15.1592 42.9738 175.1212 32.0759 115.8043 165.3336 2.3801 1.8811 0.5985 24.8888 10.5772 21.0517 4.4168 240.1665 310.2759 336.5470 24.4458 12.6114 31.8289 8.7420 4.0996 14.2395 51.6930 14.5091 27.1311 38.5957 6.4705 24.7605 29.8825 11.6810 19.7344 11.3627 1.0101 23.0975 324.3077 49.2917
temp: 298.150 k
press: 1.00000 atm
elementType: 8 8 8 8 8 8 8 7 7 7 6 6 6 6 6 6 6 6 6 6 6 6 6 6 6 1 1 1 1 1 1 1 1 1 1 1 1 1 1 1 1 1 1 1
symmnumber: 1
zpe: 886438.9 jmol-1
zpe.correction: 0.337627 hartree
zpe.thermalcorrener: 0.361933 hartree
zpe.thermalcorrenthalpy: 0.362877 hartree
zpe.thermalcorrgfe: 0.282519 hartree
zpe.sumelectzpe: -1271.911813 hartree
zpe.sumelectthermal: -1271.887507 hartree
zpe.sumelectthermalent: -1271.886563 hartree
zpe.sumelectthermalfe: -1271.966921 hartree
dipole: -0.0135 -5.0039 0.2482
dipole: 5.0101
quadrupole: -163.4804 -173.5499 -142.9553
quadrupole: 23.8597 7.0704 -6.8579
quadrupole: -3.4852 -13.5547 17.0400 23.8597 7.0704 -6.8579
hfenergy: -1272.2494399 hartree
pointgroup: C01[X(C15H19N3O7)]
dipole: -0.1696054 -1.9583122 0.1468464 debye
polarizability: 235.7787243|-5.7939316|250.5708248|3.6050622|9.72798|129.8868878 unknown
InChI: InChI=1S/C15H19N3O7/c1-15(2)23-6-8(25-15)11-9(19)10(20)13(24-11)18-5-7(4-16)12(21)17(3)14(18)22/h5,8-11,13,19-20H,6H2,1-3H3
charge 0 multiplicity 1
44 atoms
O  1.079591 -0.290776 -0.092359
O  3.844287 0.602245 0.85291
O  4.900328 -0.111586 -1.128415
O  2.011095 -3.209622 0.065318
O  -0.602204 -3.469458 0.310406
O  -2.715018 -1.97017 -0.482593
O  -4.648268 2.268552 0.085052
N  -1.312802 -0.136624 -0.095127
N  -3.678442 0.144075 -0.210641
N  -1.860933 4.634809 0.664468
C  1.943806 -0.931882 0.968035
C  1.412999 -2.367715 1.094164
C  3.424836 -0.797866 0.603398
C  -0.101839 -2.208376 0.80992
C  -0.127439 -1.064551 -0.256749
C  3.811805 -1.076516 -0.872066
C  4.564647 1.105715 -0.367121
C  3.620855 2.025071 -1.157913
C  5.867743 1.766689 0.070714
C  -2.587625 -0.720253 -0.276027
C  -1.147112 1.212633 0.130918
C  -2.228564 2.073561 0.211773
C  -3.603897 1.571276 0.036614
C  -5.019035 -0.463055 -0.400855
C  -2.030548 3.469627 0.457395
H  1.773592 -0.380181 1.913764
H  1.596979 -2.786602 2.102717
H  3.996953 -1.453375 1.28968
H  -0.636514 -1.876812 1.72389
H  -0.17784 -1.489733 -1.27754
H  4.220192 -2.083579 -1.023198
H  2.956617 -0.907052 -1.549847
H  1.317425 -3.886477 -0.174531
H  -1.511843 -3.283575 -0.070756
H  4.123992 2.386301 -2.07159
H  2.70118 1.486207 -1.441877
H  3.337412 2.895342 -0.540759
H  6.480498 1.044317 0.63295
H  6.435131 2.107424 -0.812357
H  5.655074 2.636909 0.714293
H  -0.110504 1.541506 0.23203
H  -5.076996 -0.942653 -1.391053
H  -5.757205 0.347439 -0.32088
H  -5.199908 -1.227411 0.371945
