program: Gaussian 09
title: 000298461
version: EM64L-G09RevD.01
frameworkgroup: C1[X(C8H9NO5)]
method: RPBEPBE
basis: SDD
operation: Freq
keyword: #pfreq=noraman
keyword: PBEPBE/SDD
title: #p freq=noraman PBEPBE/SDD
converged: NO YES NO YES
title: Mulliken charges:
elementType: O O O O O N C C C C C C C C H H H H H H H H H
charge: -0.202915 -0.274233 -0.247912 -0.209171 -0.190181 0.048232 0.071112 0.301543 -0.372089 0.278465 0.187696 -0.745404 -0.221021 -0.669663 0.317187 0.263196 0.263206 0.253258 0.233171 0.233169 0.216712 0.232821 0.232820
chargesum: 0.00000
title: Mulliken charges with hydrogens summed into heavy atoms:
elementType: O O O O O N C C C C C C C C
charge: -0.202915 -0.274233 -0.247912 -0.209171 -0.190181 0.048232 0.071112 0.301543 -0.054902 0.278465 0.187696 0.034256 0.245319 0.012690
polarizability: 1.69685000e+02 8.66574108e+00 1.38111119e+02 9.52803571e-03 6.21004972e-03 5.87517568e+01
1716.lowfreq: -86.3165 -10.0962 -4.0688 -2.8534 -0.0004 0.0006 0.0006 25.3601 59.0197
frequency: -86.3142 24.7221 59.0185 71.3088 73.7596 87.9142 141.2265 168.9389 206.3282 216.4013 249.9713 278.2991 303.2940 328.1320 357.5180 444.8483 464.5268 565.3870 568.4165 614.8910 679.9712 687.2978 738.8431 740.8922 793.0465 798.5901 824.8192 899.4618 910.6926 952.0351 1014.3238 1033.8049 1041.8407 1094.6281 1113.6582 1134.8521 1167.4951 1203.8784 1230.4838 1249.8279 1272.8331 1349.2566 1357.0773 1399.4616 1403.3800 1414.6269 1442.1705 1457.9487 1463.6866 1472.8730 1485.8129 1515.4137 1575.2086 1619.6551 2998.5018 3001.0827 3012.5500 3072.3210 3079.3180 3094.8707 3111.3916 3123.2974 3266.7500
redmass: 1.0159 2.6396 6.1825 4.8826 8.0438 3.6229 3.6704 6.3785 3.5069 2.6994 1.5483 5.4729 5.2935 10.1857 3.5660 6.6773 6.8224 5.1299 6.2067 5.6281 6.0883 9.3716 6.6272 10.1853 5.7587 1.1048 4.0668 1.4054 5.6302 2.5717 2.2146 1.4796 3.7130 2.6758 2.2470 1.4634 2.7842 5.7992 5.5153 1.1346 6.8803 1.9168 4.1873 1.4440 1.3356 2.5018 1.0433 1.1461 1.0399 1.0644 1.0709 9.8426 8.4844 11.4842 1.0360 1.0371 1.0581 1.1069 1.0963 1.0984 1.1027 1.1006 1.1000
irintensity: 0.3453 0.1764 0.0430 1.0238 3.1268 0.0926 3.3572 4.0203 4.4963 5.0669 5.5084 3.1421 0.4079 1.9522 12.8416 2.5004 0.0509 5.2246 0.8823 0.2515 28.1813 9.9432 14.0572 3.9733 6.3821 3.0863 0.8552 23.6689 9.2809 35.8363 0.7607 7.4620 267.8225 141.5049 1.8959 6.1003 126.9741 283.5773 127.7544 0.0438 100.8437 88.1563 101.0559 40.2431 2.2003 16.0879 19.7087 9.6479 13.0965 5.6990 15.9345 185.1365 124.5290 189.8181 17.8624 0.5139 17.5511 7.3990 2.6017 26.7901 40.5998 5.7700 10.2112
temp: 298.150 k
press: 1.00000 atm
elementType: 8 8 8 8 8 7 6 6 6 6 6 6 6 6 1 1 1 1 1 1 1 1 1
symmnumber: 1
zpe: 433794.8 jmol-1
zpe.correction: 0.165224 hartree
zpe.thermalcorrener: 0.178713 hartree
zpe.thermalcorrenthalpy: 0.179657 hartree
zpe.thermalcorrgfe: 0.123103 hartree
zpe.sumelectzpe: -739.972136 hartree
zpe.sumelectthermal: -739.958647 hartree
zpe.sumelectthermalent: -739.957702 hartree
zpe.sumelectthermalfe: -740.014257 hartree
dipole: 5.4949 1.5469 -0.0001
dipole: 5.7085
quadrupole: -92.5694 -81.3800 -78.4660
quadrupole: -15.3345 -0.0003 -0.0004
quadrupole: -8.4309 2.7585 5.6725 -15.3345 -0.0003 -0.0004
hfenergy: -740.1373597 hartree
pointgroup: C01 [X(C8H9N1O5)]
dipole: 2.1779976 0.5480227 -0.0000375 debye
dipolederiv: -0.6722361 0.0696325 -0.0000755 0.0108673 -0.3450863 -0.0000198 -0.0001521 -0.0000466 -0.0887033 -1.323365 0.525488 -0.0000431 0.8368583 -1.0077811 0.000006 0.0000101 -0.0000511 -0.2778458 -0.8371887 -0.2316848 -0.0000942 -0.026317 -0.8700909 -0.0000845 -0.0000762 -0.0000688 -0.3089138 -0.5054815 -0.0498898 0.0000081 -0.2564368 -0.9274106 -0.0001709 0.0000087 0.0002006 -0.2351968 -0.9490858 0.0351503 -0.0001642 0.1355325 -0.4306892 0.0000888 0.0001563 -0.0000558 -0.2172457 1.8818898 0.3946301 0.0001797 0.4931194 1.3529337 0.0000964 0.0000868 -0.000015 0.2129072 -0.6726427 0.1666765 -0.0000434 -0.2217882 -0.5929259 -0.0000581 -0.0001075 -0.0000282 -0.0592028 0.3637502 -0.194503 0.0000414 -0.0979203 0.8552503 0.0000611 -0.0000034 0.0001012 0.085251 0.5323275 0.3445759 0.0000811 0.2349251 0.0823497 0.0000479 0.0000317 0.0000161 -0.0820845 -0.9085755 -0.6283644 -0.0000842 -0.1650168 0.0714395 -0.0000023 -0.0001511 -0.0000817 0.0679633 1.9563132 -0.1369853 0.0001843 -0.6584382 1.4781188 0.000089 0.0001737 0.0001256 0.2448249 -0.0077949 -0.186169 0.0000094 -0.0717946 -0.3293961 -0.0000366 0.0000168 -0.0001468 -0.0010694 0.9521007 -0.3343253 0.0000164 -0.238081 0.3571535 -0.0000228 0.0000243 -0.0000217 0.3515157 -0.0432259 0.0890002 0.0000026 0.0700366 -0.0854158 -0.0000189 -0.0000002 -0.0000165 0.0587021 0.1691027 -0.0019203 -0.0000024 0.0037901 0.0935362 -0.000005 0.0000004 -0.0000022 0.1880748 0.0936797 0.0084839 -0.0820211 -0.0132939 0.0559708 -0.0074444 -0.0696042 -0.0313932 0.0150142 0.0935816 0.0084588 0.0820724 -0.013313 0.0560112 0.0074326 0.0696555 0.031399 0.0151553 -0.0377831 0.1062336 -0.0000639 0.0235353 0.0632655 0.0000074 -0.0000591 0.0000502 0.1380883 -0.064137 0.0548259 0.0178003 -0.0249983 -0.0001837 0.0908371 0.0558489 0.0811681 -0.0542607 -0.0641305 0.0548487 -0.0177907 -0.0249586 -0.0001261 -0.0908252 -0.0558636 -0.0811439 -0.0543431 -0.1680969 0.0394231 -0.0000253 0.0233524 0.0704963 -0.0000057 -0.0000271 -0.0000044 0.1190046 0.1054839 -0.0668174 0.0794942 -0.0098482 0.0262617 0.0705405 0.060183 0.0911956 -0.0587715 0.1055145 -0.0667684 -0.0794818 -0.0098121 0.0263185 -0.0705125 -0.0601516 -0.0911804 -0.0588638 unknown
polarizability: 170.1440673|7.7710869|137.6520518|0.0096977|0.0059416|58.7517568 unknown
InChI: InChI=1S/C8H9NO5/c1-3-13-8(10)6-4-7(9(11)12)14-5(6)2/h4H,3H2,1-2H3
charge 0 multiplicity 1
23 atoms
O  -1.889908 1.076378 0.000174
O  2.379722 -0.678945 0.000593
O  2.418438 1.661417 0.000839
O  -2.900453 -2.370934 0.000177
O  -4.148613 -0.43815 0.000119
N  -3.026753 -1.078292 -0.000213
C  0.309509 0.460353 0.000456
C  -0.572577 1.554533 0.000415
C  -0.482414 -0.743287 0.000211
C  -1.802478 -0.328774 0.000044
C  1.778503 0.577792 0.000693
C  -0.387491 3.031034 0.000589
C  3.878021 -0.690151 0.000739
C  4.306829 -2.152878 0.00052
H  -0.116537 -1.765569 0.000168
H  0.194213 3.349007 0.883765
H  0.194927 3.349115 -0.882074
H  -1.364587 3.53889 0.000243
H  4.22577 -0.143489 -0.894285
H  4.225588 -0.143813 0.896033
H  5.410225 -2.215636 0.00063
H  3.930236 -2.675965 0.895669
H  3.930433 -2.675638 -0.894903
