program: Gaussian 09
title: 000298450
version: EM64L-G09RevD.01
frameworkgroup: C1[X(C12H10N2)]
method: RPBEPBE
basis: SDD
operation: Freq
keyword: #pfreq=noraman
keyword: PBEPBE/SDD
title: #p freq=noraman PBEPBE/SDD
converged: NO YES NO NO
title: Mulliken charges:
elementType: N N C C C C C C C C C C C C H H H H H H H H H H
charge: -0.018890 -0.012984 0.435796 0.247366 -0.581853 -0.063003 -0.351625 -0.438727 -0.383029 -0.305787 -0.372246 -0.262511 -0.222568 -0.142592 0.242441 0.244090 0.235321 0.267044 0.273421 0.235731 0.264682 0.241404 0.232563 0.235956
chargesum: 0.00000
title: Mulliken charges with hydrogens summed into heavy atoms:
elementType: N N C C C C C C C C C C C C
charge: -0.018890 -0.012984 0.435796 0.247366 -0.095322 -0.063003 -0.116304 0.101737 -0.147298 -0.041105 -0.130842 -0.029948 0.013388 -0.142592
polarizability: 1.77749466e+02 -7.80310260e+00 1.67065381e+02 -1.43487701e+01 -3.04765634e+00 6.89706622e+01
1716.lowfreq: -12.3799 -0.0009 -0.0007 -0.0006 2.9987 5.2669 40.9442 66.2588 77.4682
frequency: 40.8787 66.2231 77.3783 150.3948 175.4276 179.2933 272.8024 297.8781 373.1377 422.4574 441.6016 460.1110 470.3977 512.5861 523.8174 576.8889 602.6855 653.2869 705.4048 767.5824 775.6008 799.6424 808.1092 849.9685 859.6673 881.9801 940.2400 962.7187 969.6012 983.3234 999.6279 1006.2801 1020.8928 1055.2325 1077.1773 1143.0671 1161.1095 1177.4775 1219.3037 1246.7154 1259.5523 1274.8558 1277.4727 1329.7002 1343.8672 1379.8398 1387.5871 1430.4463 1452.4551 1454.1104 1490.4901 1511.7584 1553.8464 1587.1208 1621.6838 2196.0176 3001.7029 3017.4676 3052.9200 3080.9852 3121.3248 3127.5689 3141.4389 3146.1174 3157.3738 3173.5067
redmass: 6.6495 5.3807 2.6035 4.5832 4.3237 6.2897 3.4578 3.9707 3.6627 3.8363 3.4242 4.4618 3.2213 6.6852 6.9663 4.7762 4.8160 3.6567 4.4658 1.2884 1.3832 2.9298 5.2209 3.0770 1.5702 1.7713 4.0881 1.4701 1.4077 2.2845 1.3323 4.2095 2.3916 2.1830 2.6719 1.4018 1.2021 1.1622 1.9845 1.6969 1.4106 1.6532 1.2461 1.4778 2.8945 2.2628 2.5039 2.7435 1.4248 1.7219 1.1512 3.3590 6.8159 6.7177 6.3876 12.4265 1.0590 1.0596 1.1010 1.1039 1.0883 1.0857 1.0898 1.0964 1.0952 1.0995
irintensity: 4.4198 3.5908 4.1582 3.6320 6.7599 0.5241 0.6735 1.3205 1.0183 5.7914 5.3527 5.4029 0.0199 0.2437 2.1843 6.5400 4.7143 1.1489 2.6026 33.8827 41.5679 4.5713 0.5493 12.1947 31.5793 2.2562 1.0942 0.1246 2.4695 0.6424 0.2859 1.4064 6.3872 0.5799 0.9276 4.9116 0.9000 1.2009 0.8426 5.0698 3.3430 3.7278 1.0263 2.8902 6.6819 6.4229 7.2112 10.8856 6.8254 5.8428 14.4373 25.8238 12.9184 24.8768 2.8611 13.7800 1.4477 20.7634 0.0409 13.7837 14.1432 2.2914 13.4503 30.2911 19.3655 17.6737
temp: 298.150 k
press: 1.00000 atm
elementType: 7 7 6 6 6 6 6 6 6 6 6 6 6 6 1 1 1 1 1 1 1 1 1 1
symmnumber: 1
zpe: 492138.8 jmol-1
zpe.correction: 0.187446 hartree
zpe.thermalcorrener: 0.198871 hartree
zpe.thermalcorrenthalpy: 0.199815 hartree
zpe.thermalcorrgfe: 0.148976 hartree
zpe.sumelectzpe: -571.803942 hartree
zpe.sumelectthermal: -571.792517 hartree
zpe.sumelectthermalent: -571.791573 hartree
zpe.sumelectthermalfe: -571.842411 hartree
dipole: 1.8263 -0.0216 0.0013
dipole: 1.8265
quadrupole: -109.6630 -72.5444 -83.2471
quadrupole: -13.9457 0.1442 0.2516
quadrupole: -21.1782 15.9404 5.2378 -13.9457 0.1442 0.2516
hfenergy: -571.9913874 hartree
pointgroup: C01 [X(C12H10N2)]
dipole: -0.7184855 0.0111646 0.0037377 debye
dipolederiv: -0.3949181 -0.0359192 0.0143678 -0.0158174 -0.3268075 0.0065416 0.0267629 0.0071326 -0.2513862 -0.367407 0.0263332 -0.0275268 0.040204 -0.2347483 0.0092213 0.0601128 -0.0129584 -0.2245896 0.4205406 0.007876 -0.0388454 -0.1002679 0.1983522 0.0224269 -0.1223577 0.0260783 -0.0684635 -0.3279436 -0.057418 0.0588653 0.1243599 -0.0174295 -0.0192298 0.0955892 0.0164747 0.0356354 -0.0004389 0.0509148 0.0241052 0.0623396 0.1029547 -0.0104995 0.032995 -0.021384 0.1096199 0.0957931 0.2348685 0.0083114 0.0062141 0.1929345 0.0047273 -0.0059261 -0.0517173 0.0550789 -0.1843849 0.2296187 -0.0108043 0.1838855 -0.246302 -0.0288202 0.0148907 -0.0609671 -0.1100065 -0.0380069 0.0667511 0.0233967 0.0836536 0.1816603 0.0076658 0.082585 0.0084299 0.1366476 0.0122089 -0.0642946 -0.0389406 -0.0662778 -0.0279668 0.0098298 -0.0757512 0.0260131 -0.1475594 0.0907547 -0.0626728 -0.0587359 -0.0868264 -0.0684822 0.0225652 -0.0564771 0.0154373 -0.1286065 0.2651359 -0.21394 -0.0719203 -0.0720795 0.3518873 0.0222756 -0.0681563 0.0592558 -0.0392074 -0.0443903 -0.1032322 -0.033035 -0.0764011 0.1183621 0.0358311 -0.0284157 0.0402429 -0.1392111 0.1045483 0.1169234 -0.0537957 0.1035702 -0.0510534 -0.0198337 -0.054639 -0.0242891 -0.1411768 0.2010373 -0.0769585 -0.0388213 -0.0680593 -0.028697 0.0149563 -0.1818998 0.0448474 -0.07904 0.0546604 0.0008326 -0.0216814 0.0395159 -0.0201082 -0.1135345 -0.0122869 -0.0637652 -0.0010415 0.0025828 -0.0451484 0.0324802 -0.095225 -0.0394813 0.0932345 0.0119969 0.0411937 0.0435165 -0.0263017 -0.1237246 0.0401992 -0.0957527 0.0159418 0.0103451 0.0388953 0.0228288 0.1370037 0.0555742 0.0252703 -0.0146365 -0.0025242 0.0121556 -0.0934103 -0.0017016 -0.0494889 0.0365442 0.0532508 -0.0364999 0.0479446 -0.0288128 0.0039399 0.0708903 0.0583045 0.0300448 0.073992 -0.0700247 0.0911152 0.0515504 0.0648279 0.0533566 -0.0076937 0.0645718 -0.0252075 0.1274721 -0.0236773 0.0200184 0.0412767 0.0734896 0.0780477 -0.0205353 0.0466895 -0.007571 0.1474359 0.0712571 0.023668 0.0101672 0.0237387 -0.1403467 -0.0122797 0.0153049 -0.0161658 0.1221215 0.0876487 0.0283933 0.0177495 0.0124931 -0.1151933 -0.0211085 0.0191777 -0.022081 0.1526327 -0.0374995 -0.1027753 0.0383288 -0.1102479 0.0070235 0.0164344 0.0397354 0.0176161 0.1525881 unknown
polarizability: 177.9821696|7.1363026|166.7582265|-15.1358363|0.8851443|69.0451133 unknown
InChI: InChI=1S/C12H10N2/c13-8-3-4-10-7-9-14-12-6-2-1-5-11(10)12/h1-2,5-7,9H,3-4H2
charge 0 multiplicity 1
24 atoms
N  -2.215302 1.750482 0.248782
N  5.052427 -0.983382 0.137334
C  0.43134 0.793014 -0.402276
C  -0.649283 -0.145657 -0.199873
C  1.848687 0.331402 -0.695791
C  -1.960127 0.387149 0.127193
C  0.141923 2.157433 -0.280466
C  2.572494 -0.127452 0.613808
C  -0.500087 -1.568202 -0.310897
C  -3.055875 -0.509685 0.336396
C  -1.182998 2.588758 0.043473
C  -1.587762 -2.420481 -0.10282
C  -2.874892 -1.889763 0.226014
C  3.943406 -0.601814 0.360324
H  1.85893 -0.501667 -1.421007
H  2.426929 1.157074 -1.145595
H  0.926434 2.906878 -0.433828
H  2.611347 0.714174 1.3303
H  1.998474 -0.936486 1.10275
H  0.473005 -1.997701 -0.573986
H  -4.026522 -0.067383 0.58037
H  -1.402188 3.659136 0.13749
H  -1.457601 -3.504287 -0.195104
H  -3.717463 -2.570942 0.386109
