program: Gaussian 09
title: 000027094
version: EM64L-G09RevD.01
frameworkgroup: C1[X(C15H24N2O2)]
method: RPBEPBE
basis: SDD
operation: Freq
keyword: #p
keyword: freq=noraman
keyword: PBEPBE/SDD
title: #p freq=noraman PBEPBE/SDD
converged: YES YES NO NO
title: Mulliken charges:
elementType: O O N N C C C C C C C C C C C C C C C H H H H H H H H H H H H H H H H H H H H H H H H
charge: -0.297202 -0.270002 -0.113619 -0.685223 -0.336559 -0.336400 -0.398217 -0.357225 -0.360087 -0.261346 -0.684963 -0.685379 0.185507 0.225121 -0.336309 -0.326074 -0.406252 -0.400817 0.499838 0.183272 0.203166 0.200501 0.182348 0.218726 0.211093 0.217188 0.193025 0.195406 0.216418 0.225102 0.238845 0.206485 0.209652 0.219870 0.206989 0.207494 0.220481 0.265474 0.263983 0.220640 0.218630 0.310517 0.309902
chargesum: 0.00000
title: Mulliken charges with hydrogens summed into heavy atoms:
elementType: O O N N C C C C C C C C C C C C C C C
charge: -0.297202 -0.270002 -0.113619 -0.064805 0.049879 0.046449 0.031603 0.052988 0.051737 0.202601 -0.048956 -0.050414 0.185507 0.225121 -0.070834 -0.062092 -0.185612 -0.182187 0.499838
polarizability: 2.82220127e+02 1.15822830e+01 1.61511431e+02 -1.30959528e+01 -2.37605028e+01 1.50185923e+02
1716.lowfreq: -4.1972 -0.0007 -0.0004 0.0004 5.3540 10.7492 16.0988 23.2451 36.2596
frequency: 14.2101 22.6652 36.2107 46.0255 59.2184 71.5451 73.6998 77.9597 82.3641 99.2833 154.9984 169.1597 195.7500 206.4118 219.5384 224.5262 230.6562 270.4672 293.7681 313.5673 343.9697 350.0872 367.5536 402.4937 406.8814 412.1115 416.6462 454.5308 508.4087 512.1342 537.0008 607.5561 634.0928 677.7657 744.7867 746.3202 755.7325 770.8823 783.4879 818.4513 824.5693 834.4604 843.5260 870.2044 874.9504 895.4962 913.9245 922.3917 973.1881 983.9850 997.9242 1017.9018 1032.2188 1045.4917 1056.4495 1060.2395 1068.4126 1093.9245 1103.0038 1115.8767 1129.1092 1130.0374 1161.4956 1179.6473 1199.2045 1221.6677 1249.3417 1254.7671 1259.4084 1276.1179 1289.2341 1291.6433 1307.4175 1308.4847 1317.5579 1323.2498 1329.4296 1367.6695 1370.8832 1384.9362 1389.5608 1391.9329 1392.6771 1447.4051 1465.7125 1466.6886 1469.9136 1475.7713 1477.4266 1477.9336 1478.6860 1481.3653 1488.3257 1489.4874 1517.1062 1570.5579 1611.9061 1631.8766 1646.2622 2847.5642 2856.6279 2905.7508 2972.3016 2972.5984 2983.6167 2985.0403 3011.7529 3012.9279 3019.3799 3039.0425 3041.2026 3045.3096 3069.7321 3070.6800 3074.7121 3074.9737 3085.5993 3122.9645 3125.7983 3158.5264 3172.9914 3561.2163 3701.1976
redmass: 4.4228 4.3308 4.1678 3.6639 3.4401 2.0498 1.7728 2.4552 4.0751 3.9610 3.6899 2.6296 3.7191 1.8109 1.1420 2.7575 1.4617 3.6464 4.8033 3.3975 4.5530 2.8569 3.0780 3.4772 1.1724 1.2352 2.1533 3.8004 2.8382 3.0900 4.6061 6.3310 6.9121 3.9717 1.1036 1.0923 4.3671 6.5491 1.1826 3.8986 1.2685 3.7689 1.8416 1.3343 1.2178 1.6091 2.5425 4.3395 1.3624 1.3515 3.2285 1.4738 2.6100 2.7819 4.1194 2.1678 2.5215 2.2651 2.1487 2.1655 1.8293 1.2162 1.3946 1.1376 2.0544 1.5530 1.7749 1.7217 1.3869 1.1584 1.1626 1.1502 1.3636 1.3362 1.4443 2.0979 1.8236 1.3967 1.4301 1.4420 1.2443 4.6157 1.2372 4.2020 1.0714 1.0687 1.0745 1.0741 1.0578 1.0429 1.0435 1.0729 1.0842 1.0856 3.2035 7.3267 10.2683 3.2502 1.4352 1.0709 1.0706 1.0700 1.0357 1.0357 1.0624 1.0625 1.0764 1.0676 1.0869 1.0986 1.0990 1.0910 1.1012 1.1013 1.0989 1.0989 1.1079 1.0894 1.0892 1.0953 1.0948 1.0450 1.1040
irintensity: 0.8817 0.6074 1.1076 0.8130 0.2397 0.1722 0.3312 0.6979 0.4633 1.3043 0.1359 0.8414 1.1991 1.1064 0.3296 0.2419 0.4410 11.0925 9.9349 3.2635 0.6338 5.1940 1.9589 18.8734 201.4714 108.4001 5.7976 1.8270 3.8764 7.7928 5.6778 9.6519 2.0883 26.8787 6.8484 7.6714 12.9814 19.2189 2.3405 12.0502 0.9307 6.2745 71.1755 4.7849 2.4353 2.3152 4.8079 33.4459 0.2044 0.1575 38.6441 14.2745 30.8214 5.7438 357.9478 16.9269 165.8625 0.9764 10.8425 4.8216 1.6312 13.7403 3.7576 199.9498 13.1337 9.7287 222.9126 164.5219 1.5560 3.9146 2.0480 4.6438 2.5583 1.4712 9.3256 46.2567 92.0625 2.0063 10.5109 11.6367 14.6945 14.8904 10.2728 6.6040 1.2400 0.4361 3.3388 0.7769 3.0642 14.1796 9.4529 15.9902 13.9240 10.3821 68.6362 29.2175 342.7658 98.5172 324.1243 41.1102 146.7756 79.2207 56.4751 34.1946 24.9740 23.7019 31.3190 13.0187 20.0256 2.8254 14.3782 16.5349 75.0930 101.4419 34.8668 63.0325 40.4070 15.8453 23.0588 9.6638 3.9640 110.5882 22.8887
temp: 298.150 k
press: 1.00000 atm
elementType: 8 8 7 7 6 6 6 6 6 6 6 6 6 6 6 6 6 6 6 1 1 1 1 1 1 1 1 1 1 1 1 1 1 1 1 1 1 1 1 1 1 1 1
symmnumber: 1
zpe: 964635.5 jmol-1
zpe.correction: 0.367410 hartree
zpe.thermalcorrener: 0.388989 hartree
zpe.thermalcorrenthalpy: 0.389933 hartree
zpe.thermalcorrgfe: 0.313661 hartree
zpe.sumelectzpe: -844.467656 hartree
zpe.sumelectthermal: -844.446077 hartree
zpe.sumelectthermalent: -844.445133 hartree
zpe.sumelectthermalfe: -844.521405 hartree
dipole: 2.8488 2.1474 -3.0595
dipole: 4.6997
quadrupole: -66.0637 -117.0189 -118.1428
quadrupole: 5.9331 -5.8333 -1.3525
quadrupole: 34.3448 -16.6104 -17.7344 5.9331 -5.8333 -1.3525
hfenergy: -844.8350665 hartree
pointgroup: C01 [X(C15H24N2O2)]
dipole: 1.1280562 0.8790211 -1.1720493 debye
polarizability: 282.3311601|12.7898328|162.7540112|-11.3221341|-23.4097613|148.8323101 unknown
InChI: InChI=1S/C15H24N2O2/c1-3-9-17(10-4-2)11-12-19-15(18)13-5-7-14(16)8-6-13/h5-8H,3-4,9-12,16H2,1-2H3
charge 0 multiplicity 1
43 atoms
O  0.409119 0.027885 0.025377
O  1.131914 -1.408934 1.716065
N  -3.319961 0.172234 -0.279668
N  6.738331 0.792062 -0.76163
C  -3.822911 -1.056046 -0.946207
C  -4.219242 1.345855 -0.408078
C  -1.897204 0.468063 -0.56873
C  -4.917464 -1.780442 -0.132619
C  -4.119343 2.31443 0.790222
C  -0.993043 -0.283965 0.416019
C  -5.451674 -3.033949 -0.858989
C  -5.047384 3.538591 0.633502
C  1.407937 -0.609119 0.782809
C  2.770145 -0.224793 0.351987
C  3.882448 -0.791886 1.032204
C  3.011502 0.689373 -0.709799
C  5.195245 -0.460864 0.669664
C  4.321303 1.027879 -1.081485
C  5.4383 0.458178 -0.397006
H  -4.209353 -0.8362 -1.974468
H  -2.970779 -1.750783 -1.077621
H  -5.259824 0.974958 -0.470227
H  -4.029614 1.910631 -1.356962
H  -1.716579 1.551769 -0.454648
H  -1.60848 0.203015 -1.612843
H  -4.494331 -2.052934 0.852572
H  -5.755293 -1.084212 0.068946
H  -3.07223 2.657516 0.907678
H  -4.369317 1.753706 1.710618
H  -1.145163 -1.377919 0.374852
H  -1.169595 0.048515 1.453731
H  -5.897029 -2.770664 -1.837427
H  -4.641264 -3.764077 -1.045598
H  -6.229276 -3.541819 -0.260262
H  -4.795394 4.120076 -0.273973
H  -6.106626 3.22912 0.549334
H  -4.964035 4.217051 1.501771
H  3.687353 -1.49476 1.849211
H  2.158302 1.127967 -1.235018
H  6.042631 -0.906491 1.20469
H  4.493919 1.734695 -1.902309
H  7.53542 0.389308 -0.277063
H  6.91654 1.44558 -1.51892
