program: Gaussian 09
title: 000298448
version: EM64L-G09RevD.01
frameworkgroup: C1[X(C14H16N4O)]
method: RPBEPBE
basis: SDD
operation: Freq
keyword: #p
keyword: freq=noraman
keyword: PBEPBE/SDD
title: #p freq=noraman PBEPBE/SDD
converged: YES YES NO NO
title: Mulliken charges:
elementType: O N N N N C C C C C C C C C C C C C C H H H H H H H H H H H H H H H H
charge: -0.247054 -0.014461 0.049789 -0.412677 -0.650318 -0.549046 0.533255 -0.510043 -0.498510 0.426945 0.168962 -0.062511 -0.521847 -0.405899 -0.302118 -0.815891 -0.248243 -0.224621 0.295717 0.203351 0.224473 0.257312 0.214556 0.239390 0.246502 0.231704 0.261999 0.249038 0.233490 0.239897 0.227542 0.230989 0.286746 0.342470 0.299112
chargesum: 0.00000
title: Mulliken charges with hydrogens summed into heavy atoms:
elementType: O N N N N C C C C C C C C C C C C C C
charge: -0.247054 -0.014461 0.049789 -0.125932 -0.008736 -0.121222 0.533255 -0.038174 -0.259120 0.426945 0.168962 -0.062511 -0.275345 -0.174195 -0.040120 -0.093465 -0.020702 0.006369 0.295717
polarizability: 1.82058288e+02 3.52605865e+01 2.03236763e+02 -1.54954258e+01 -3.27473907e+00 1.75559251e+02
1716.lowfreq: -8.6091 -3.9615 -1.3964 -0.0004 0.0006 0.0007 13.0734 17.3794 29.5329
frequency: 12.7964 17.2187 29.4597 48.7475 77.8661 104.1403 111.0552 123.1251 172.0053 181.3354 212.2835 271.6494 276.6492 287.2729 318.5473 352.5524 390.2664 410.9279 412.8940 446.3129 462.9217 482.5507 489.5183 503.1440 519.3547 552.7552 559.0531 577.4405 607.6776 626.8485 652.8182 688.9041 709.3813 753.0531 762.5660 780.1028 800.4954 854.5408 874.6167 893.3215 916.4040 930.4873 942.1550 942.4073 966.4045 970.6032 994.0565 995.3989 1015.4323 1020.7560 1024.7094 1044.9305 1103.6452 1117.5705 1153.9813 1169.3349 1183.5472 1205.5359 1212.8780 1247.4588 1268.9240 1277.9727 1291.1124 1312.8731 1344.0175 1361.7082 1366.6071 1382.2586 1398.0813 1427.6301 1445.9478 1455.2161 1455.7858 1464.9818 1479.5086 1492.0224 1501.6603 1557.1183 1600.9868 1603.0497 1608.0250 1625.8895 1684.2615 2952.2617 2965.9815 2982.5803 3022.8540 3031.6619 3071.8509 3094.5969 3104.8655 3109.1507 3116.2448 3135.8089 3153.9005 3170.7767 3417.9695 3535.2624 3692.1319
redmass: 5.6021 5.4486 4.9265 3.7370 4.7635 4.7854 3.1673 1.4553 3.1005 3.6608 3.7132 2.6666 2.1484 2.4070 2.3039 2.4804 2.9393 3.3600 3.8036 2.8532 2.1579 2.7682 2.3564 1.2223 7.3257 3.5752 2.3698 2.8275 6.5962 4.4446 3.0324 4.1792 8.4061 4.9296 1.3215 2.9467 2.6888 2.9404 1.5620 2.0588 2.2182 2.3252 2.0362 1.5088 2.0835 1.7579 1.8565 1.3293 2.2458 1.6906 3.0258 2.2620 2.3214 1.7167 1.6507 1.2679 1.3406 1.1996 2.2660 2.1878 2.0299 1.9905 2.3787 1.4160 1.7265 3.9907 1.6895 1.2306 2.5757 4.5305 1.1484 1.3494 1.8932 1.1225 1.0906 3.3343 1.4640 7.2373 1.4263 5.9136 4.0390 6.7185 5.5547 1.0398 1.0646 1.0615 1.0975 1.1013 1.0951 1.0949 1.0909 1.0919 1.0875 1.0890 1.0948 1.0991 1.0747 1.0458 1.1033
irintensity: 2.7202 1.8486 10.6428 6.2015 0.1894 8.5309 1.6847 1.4969 1.4061 0.5701 1.7137 3.3196 1.3408 4.2113 19.1069 5.8043 27.3199 1.9285 9.0985 25.2149 86.0606 39.2718 97.1748 66.5960 0.0399 15.3899 40.0793 32.2302 3.0542 9.8776 3.6507 0.9174 22.9523 1.4107 55.9715 13.5128 14.5032 3.7026 8.8350 8.2879 3.5577 13.5122 8.7391 1.5560 4.3235 5.2014 8.7575 0.1321 8.8132 8.6823 3.3550 28.1590 72.2768 8.9966 46.9303 36.3813 1.0847 8.5832 2.7730 4.3492 25.3025 43.6384 244.0075 18.4596 3.4281 7.5999 11.7098 32.1241 2.4032 0.9242 69.2077 89.1282 21.2047 13.1785 35.3245 19.6672 162.2079 2.5412 112.0351 4.0843 7.6722 0.2859 303.8294 16.5239 23.3477 71.3756 27.3588 15.6391 16.0250 16.3526 17.4175 22.8838 8.0307 12.6076 25.0152 21.5684 10.2600 38.9127 38.1780
temp: 298.150 k
press: 1.00000 atm
elementType: 8 7 7 7 7 6 6 6 6 6 6 6 6 6 6 6 6 6 6 1 1 1 1 1 1 1 1 1 1 1 1 1 1 1 1
symmnumber: 1
zpe: 732888.6 jmol-1
zpe.correction: 0.279143 hartree
zpe.thermalcorrener: 0.297112 hartree
zpe.thermalcorrenthalpy: 0.298056 hartree
zpe.thermalcorrgfe: 0.230068 hartree
zpe.sumelectzpe: -835.938048 hartree
zpe.sumelectthermal: -835.920079 hartree
zpe.sumelectthermalent: -835.919135 hartree
zpe.sumelectthermalfe: -835.987123 hartree
dipole: -0.2040 0.8498 7.9889
dipole: 8.0365
quadrupole: -116.1758 -93.4487 -111.2544
quadrupole: 4.2067 14.0537 -8.2785
quadrupole: -9.2162 13.5109 -4.2947 4.2067 14.0537 -8.2785
hfenergy: -836.2171909 hartree
pointgroup: C01 [X(C14H16N4O1)]
dipole: 0.4766565 0.2570876 -3.1150798 debye
polarizability: 193.7893621|-38.7927571|187.9326318|11.4202479|-3.725585|179.132308 unknown
InChI: InChI=1S/C14H16N4O/c1-10(17-18-14(15)19)6-7-11-8-12-4-2-3-5-13(12)16-9-11/h2-5,8-9,18H,6-7,15H2,1H3
charge 0 multiplicity 1
35 atoms
O  3.273116 2.317734 2.510869
N  -1.910409 -0.989595 1.415788
N  2.74715 0.167706 0.753617
N  3.100418 1.436489 0.316446
N  3.410458 3.728705 0.655233
C  1.031848 -2.761925 -0.282017
C  -0.209995 -1.902156 -0.12543
C  2.303513 -2.168516 0.406173
C  -0.818032 -1.257783 -1.206728
C  -1.986831 -0.451605 -1.009835
C  2.721762 -0.812284 -0.127101
C  -2.507124 -0.341935 0.337714
C  -0.812809 -1.725733 1.172164
C  -2.656813 0.236487 -2.072592
C  -3.672767 0.451965 0.578393
C  3.081666 -0.666915 -1.598833
C  -3.7940 1.005725 -1.81108
C  -4.304565 1.114976 -0.477489
C  3.252377 2.478621 1.266184
H  1.233348 -2.92635 -1.358228
H  0.853823 -3.762756 0.159372
H  2.134908 -2.062622 1.491747
H  3.130757 -2.895465 0.266695
H  -0.408867 -1.369764 -2.219802
H  -0.36592 -2.219586 2.045424
H  -2.26732 0.150309 -3.09476
H  -4.039299 0.516163 1.607566
H  3.136966 -1.651988 -2.089025
H  4.067966 -0.177003 -1.731228
H  2.330392 -0.064088 -2.149922
H  -4.302919 1.529471 -2.627976
H  -5.19644 1.722664 -0.289062
H  3.288292 1.629954 -0.675689
H  3.571906 4.516296 1.278083
H  3.190645 3.914305 -0.321471
