program: Gaussian 09
title: 000298535
version: EM64L-G09RevD.01
frameworkgroup: C1[X(C16H21N3O9)]
method: RPBEPBE
basis: SDD
operation: Freq
keyword: #p
keyword: freq=noraman
keyword: PBEPBE/SDD
title: #p freq=noraman PBEPBE/SDD
converged: NO YES NO NO
title: Mulliken charges:
elementType: O O O O O O O O O N N N C C C C C C C C C C C C C C C C H H H H H H H H H H H H H H H H H H H H H
charge: -0.283059 -0.248010 -0.228763 -0.409438 -0.293453 -0.280189 -0.219520 -0.296579 -0.211005 -0.180200 -0.404091 -0.458580 -0.108241 -0.055947 -0.158384 -0.070188 -0.367357 0.330945 -0.704561 -0.713855 -0.157605 0.257240 0.015461 0.156340 0.207893 0.297517 -0.253030 -0.663130 0.256923 0.228517 0.212875 0.302279 0.194775 0.257904 0.217671 0.244658 0.240312 0.222042 0.250152 0.217883 0.380820 0.341742 0.375223 0.399385 0.235461 0.224005 0.216917 0.227554 0.252690
chargesum: 0.00000
title: Mulliken charges with hydrogens summed into heavy atoms:
elementType: O O O O O O O O O N N N C C C C C C C C C C C C C C C C
charge: -0.283059 -0.248010 -0.228763 -0.028618 -0.293453 -0.280189 -0.219520 -0.296579 -0.211005 -0.180200 -0.028867 -0.059195 0.148682 0.172570 0.054491 0.232091 0.085322 0.330945 -0.001920 -0.023777 0.184137 0.257240 0.015461 0.156340 0.207893 0.297517 0.206435 0.034031
polarizability: 3.50819296e+02 -7.66600426e+00 2.19924887e+02 -4.47097000e+00 6.35145117e+00 1.40875199e+02
1716.lowfreq: -12.0381 -5.9498 -5.4760 -0.0012 -0.0006 0.0005 13.7856 17.9043 27.5686
frequency: 11.8129 17.5531 27.5063 34.5990 49.4901 64.9524 66.5935 86.4023 90.5282 98.4356 121.2070 137.3662 143.6763 155.5671 168.0305 177.5485 190.3563 199.0959 209.0993 229.6253 246.5904 273.3465 281.4814 295.4352 304.2348 309.4078 322.4962 337.5144 357.5837 386.5897 390.8839 411.4790 423.5980 431.7935 441.9585 454.8464 480.3809 511.3183 519.2985 567.4813 584.0801 605.1735 618.0530 632.5873 658.3784 667.1424 681.7005 708.9552 714.0648 714.2514 745.7778 757.0225 758.3592 780.4291 792.7974 797.9739 808.4102 816.3635 861.0550 874.9508 906.8101 911.3176 915.5531 918.1443 927.0985 938.6748 946.7029 992.2226 999.4462 1001.4758 1014.1988 1022.2891 1027.7849 1047.6483 1084.7315 1095.3294 1095.7045 1098.7831 1108.8950 1144.6109 1154.4392 1155.9307 1175.2236 1187.5599 1215.9176 1223.7801 1231.4996 1237.9207 1256.7100 1266.5117 1275.7377 1281.5863 1291.0333 1299.5996 1308.0533 1326.1107 1333.8227 1349.2457 1355.0535 1357.9772 1369.4497 1379.6546 1392.2437 1393.9391 1410.9657 1419.4341 1447.6173 1453.7493 1456.7802 1460.8377 1463.6969 1471.1544 1482.7219 1484.7304 1510.6067 1580.3406 1592.4445 1632.4901 1666.6754 1691.7750 2904.2024 2963.1734 2984.0630 2993.1468 2998.8991 3012.6785 3013.7082 3028.0979 3042.9167 3087.3768 3088.5966 3093.4287 3093.4968 3106.2234 3119.3421 3119.5430 3124.7893 3182.5607 3259.0796 3380.2915 3513.8368
redmass: 4.5007 5.9843 4.5522 4.6924 5.5831 6.7673 6.7131 5.9122 3.9603 3.7719 3.1118 2.8124 1.9399 3.0858 6.8004 5.3221 2.7353 2.3060 1.6338 2.5694 3.1286 5.5566 3.6263 3.6475 5.8119 3.5895 3.4487 7.5749 3.8558 8.5630 3.5452 3.0736 3.9172 4.3805 3.8335 6.7904 4.2690 5.8366 4.4863 6.6863 7.2915 1.1401 4.3550 5.1658 5.3676 6.7374 5.5054 3.2549 5.5275 6.2915 4.0296 6.9396 3.5322 3.9040 5.5356 2.5575 1.2786 5.3205 4.2729 3.2086 2.7463 3.7068 2.2646 1.2637 1.4914 4.9992 2.5600 1.4566 1.9423 1.6217 3.8079 4.8573 4.3380 4.3322 2.9107 2.2211 2.3656 3.9600 6.6458 1.9197 1.8477 4.6236 2.9921 2.4583 1.2455 1.4178 1.6219 1.4449 1.2485 1.7665 2.5984 1.1109 1.3645 2.1553 1.5684 1.4557 1.5209 2.0700 1.6756 1.3688 1.3023 1.2771 1.2328 1.2374 1.8124 4.1308 1.0651 1.0580 1.0899 1.0508 1.0444 1.0613 1.0507 1.0512 2.2493 5.8317 6.8970 7.6168 4.1432 10.0836 1.0824 1.0696 1.0825 1.0361 1.0384 1.0735 1.0450 1.0602 1.0868 1.0947 1.0973 1.1031 1.0986 1.1007 1.1057 1.1004 1.1004 1.0922 1.0823 1.0657 1.0772
irintensity: 0.5989 3.0936 0.9921 0.8922 0.7207 0.4730 1.1540 0.8129 1.0275 1.4840 2.1123 0.6184 2.0389 7.4739 0.1373 2.4417 4.0478 8.7466 1.2744 4.3665 23.5321 4.5496 4.1434 31.0020 9.2805 2.1400 0.8690 5.4782 2.9589 9.8928 1.8956 1.2445 2.9978 5.6696 12.4892 12.4010 14.9893 19.3698 4.0716 23.9134 14.8784 131.1908 24.7838 7.8099 12.2313 3.3592 12.4827 3.8318 8.5021 26.4829 11.2812 20.8556 10.9199 18.0243 61.5011 95.9740 1.0754 20.0948 21.0194 26.0343 35.7664 7.1398 18.4753 115.9451 3.1768 39.0091 40.2713 0.4562 9.8202 19.2397 178.1767 150.5585 152.6639 221.9430 179.4093 127.8394 0.2453 49.3327 13.0181 75.0396 171.1900 31.9471 314.6830 135.5990 1.9794 134.0981 62.4330 2.3064 7.2842 109.1751 37.8701 5.8523 7.9192 67.2944 10.0889 66.7231 14.0825 47.1873 71.2575 2.8418 5.5230 45.6905 33.7814 32.8826 46.8069 360.5842 4.9009 10.2387 19.6909 7.7522 13.0949 5.9959 5.9711 8.8670 1200.6178 25.2836 253.9755 384.2505 460.0364 281.3023 44.7309 19.7109 45.3582 21.2091 4.9003 64.2469 13.4531 35.0855 6.2873 15.0022 40.0670 0.5154 29.9241 4.6963 31.3530 21.9706 18.5230 17.9353 279.4289 264.8267 75.1171
temp: 298.150 k
press: 1.00000 atm
elementType: 8 8 8 8 8 8 8 8 8 7 7 7 6 6 6 6 6 6 6 6 6 6 6 6 6 6 6 6 1 1 1 1 1 1 1 1 1 1 1 1 1 1 1 1 1 1 1 1 1
symmnumber: 1
zpe: 986659.5 jmol-1
zpe.correction: 0.375799 hartree
zpe.thermalcorrener: 0.402824 hartree
zpe.thermalcorrenthalpy: 0.403768 hartree
zpe.thermalcorrgfe: 0.315786 hartree
zpe.sumelectzpe: -1461.481547 hartree
zpe.sumelectthermal: -1461.454522 hartree
zpe.sumelectthermalent: -1461.453578 hartree
zpe.sumelectthermalfe: -1461.541560 hartree
dipole: -1.6645 0.9629 -2.0988
dipole: 2.8465
quadrupole: -145.5504 -178.6439 -158.6342
quadrupole: 20.6757 10.6029 5.3329
quadrupole: 15.3924 -17.7011 2.3087 20.6757 10.6029 5.3329
hfenergy: -1461.8573456 hartree
pointgroup: C01 [X(C16H21N3O9)]
dipole: 0.6763288 -0.1243689 -0.8838981 debye
polarizability: 350.5580068|-9.3177526|216.8354198|7.1225244|16.4378983|144.2259552 unknown
InChI: InChI=1S/C16H21N3O9/c1-4-25-15(24)18-12(22)7-5-19(14(23)17-11(7)21)13-9(20)10-8(27-13)6-26-16(2,3)28-10/h5,8-10,13,17-18,20H,4,6H2,1-3H3
charge 0 multiplicity 1
49 atoms
O  1.969331 0.658899 0.311713
O  4.829543 -0.116172 -0.107061
O  4.647062 1.921898 1.189409
O  3.564234 -2.096758 -1.506522
O  1.152941 -3.281749 -0.95236
O  -3.397757 -2.294743 -1.021123
O  -2.452462 1.815891 0.012634
O  -6.422289 0.300075 -0.636908
O  -5.344698 2.327327 -0.115421
N  0.497716 -1.088506 -0.403416
N  -1.114772 -2.72444 -0.950687
N  -4.178015 0.270028 -0.466037
C  3.866056 0.320446 -1.120993
C  2.932799 1.415498 -0.55929
C  2.882373 -0.844912 -1.358554
C  1.944102 -0.727142 -0.104894
C  3.63797 2.479987 0.285468
C  5.587207 0.99048 0.530697
C  6.484791 1.715765 -0.492465
C  6.365072 0.333374 1.664088
C  -0.520669 -0.171427 -0.251994
C  0.235682 -2.425567 -0.778576
C  -1.856152 -0.475059 -0.456653
C  -2.225107 -1.843725 -0.819522
C  -2.842398 0.652432 -0.277324
C  -5.303499 1.108733 -0.371168
C  -7.744732 0.987053 -0.553536
C  -8.247335 1.035314 0.891962
H  4.369622 0.629117 -2.057221
H  2.358524 1.905804 -1.372869
H  2.271371 -0.5944 -2.259074
H  2.296424 -1.385025 0.710507
H  4.082103 3.23629 -0.396023
H  2.909334 2.982659 0.941737
H  5.910917 2.196833 -1.303202
H  7.180615 0.991828 -0.94923
H  7.069672 2.497384 0.021281
H  7.066204 -0.414968 1.260032
H  5.658926 -0.167714 2.344645
H  6.925935 1.096074 2.2290
H  2.882411 -2.820153 -1.386906
H  -0.224433 0.835926 0.051733
H  -1.329601 -3.691919 -1.217023
H  -4.348592 -0.726668 -0.706092
H  -7.640335 2.00221 -0.975855
H  -8.392407 0.372002 -1.198344
H  -9.264291 1.469228 0.917437
H  -8.292863 0.022085 1.327037
H  -7.589635 1.665207 1.514062
