program: Gaussian 09
title: 000298431
version: EM64L-G09RevD.01
frameworkgroup: C1[X(C19H18N2O)]
method: RPBEPBE
basis: SDD
operation: Freq
keyword: #p
keyword: freq=noraman
keyword: PBEPBE/SDD
title: #p freq=noraman PBEPBE/SDD
converged: YES YES NO NO
title: Mulliken charges:
elementType: O N N C C C C C C C C C C C C C C C C C C C H H H H H H H H H H H H H H H H H H
charge: -0.372139 -0.151467 -0.044417 -0.639250 -0.539400 0.373006 0.507448 0.465202 -0.292419 -0.376887 -0.368599 -0.412878 -0.448601 -0.251620 -0.226357 -0.232064 -0.232477 -0.234741 -0.224345 -0.183707 -0.243928 -0.241209 0.307209 0.242945 0.241904 0.233822 0.249804 0.238755 0.268109 0.241416 0.233300 0.276294 0.239479 0.225262 0.229865 0.225418 0.227166 0.232481 0.227929 0.229694
chargesum: 0.00000
title: Mulliken charges with hydrogens summed into heavy atoms:
elementType: O N N C C C C C C C C C C C C C C C C C C C
charge: -0.372139 -0.151467 -0.044417 -0.089097 -0.063674 0.373006 0.507448 0.465202 -0.042616 -0.138132 -0.100491 -0.171462 -0.215302 0.024674 0.013122 -0.006802 -0.002612 -0.009323 0.002821 0.048774 -0.015999 -0.011515
polarizability: 2.83318270e+02 2.97458771e+01 2.09501495e+02 -1.59172241e+01 2.75995722e+01 1.71518918e+02
1716.lowfreq: -11.4245 -4.3720 -1.7820 -0.0008 -0.0007 -0.0007 13.5303 21.4924 34.1220
frequency: 10.5392 21.4622 34.0151 38.7396 47.0235 62.3743 111.0579 118.4619 186.6154 195.5622 207.9552 240.3004 268.4828 292.3886 378.3325 381.5838 403.2925 405.9666 406.5438 463.2433 471.8229 480.0205 505.1086 546.3969 563.0235 575.0845 602.2808 616.3940 617.2157 621.2257 703.2283 704.8074 707.4786 719.1909 743.8030 754.0503 765.0085 805.0146 812.4319 828.8835 835.2798 854.5668 861.9675 908.2608 912.0507 921.7476 938.1836 949.7055 963.4030 977.2738 984.6760 989.6231 990.2304 996.0633 1000.9002 1020.5464 1025.5055 1029.4338 1043.7158 1084.3959 1086.8615 1089.8559 1124.0029 1156.6106 1171.5912 1172.3059 1185.7127 1186.7893 1195.5931 1208.8371 1209.4696 1221.5921 1242.4416 1274.3973 1297.0640 1316.1635 1321.8263 1337.0840 1355.1068 1375.2074 1385.9413 1392.1547 1410.7255 1440.5610 1441.8325 1467.6301 1478.4920 1484.6839 1491.0582 1501.5245 1544.3355 1591.2929 1595.1865 1608.4102 1610.9897 1614.7912 2935.2264 3010.1277 3021.1844 3078.5514 3112.3644 3113.7851 3117.7189 3125.0610 3130.7105 3135.5248 3142.2525 3146.6996 3154.2738 3160.6647 3163.1806 3169.3059 3181.8314 3207.1636
redmass: 4.1836 5.2373 4.6120 3.8942 5.8354 4.6646 5.0258 4.0021 4.7837 5.6241 4.5269 5.7099 4.0123 3.1961 5.5118 2.8405 2.8031 2.7899 2.3882 3.8744 3.2635 4.2688 4.8502 4.2608 5.4874 5.4530 4.1137 6.3402 6.3545 4.9210 2.8547 2.1902 2.6316 2.5661 1.3402 1.6127 2.5317 4.0108 3.3800 1.3796 4.8681 1.2501 1.2485 1.5198 1.6215 1.4054 2.0510 1.3011 1.8912 1.3961 1.4025 5.8445 5.6760 1.3189 1.3511 2.3620 2.2293 2.1159 2.0945 1.6513 1.6770 2.2685 2.1125 1.1706 1.0550 1.0551 1.1122 1.1312 2.9676 2.8755 2.8216 1.6540 1.3058 2.9604 1.7313 1.3530 1.2875 1.3154 1.4862 4.2689 4.5457 2.8048 2.1921 2.1540 2.0731 1.1877 1.9739 2.0486 1.2433 2.8199 6.7258 5.9947 6.0777 5.8450 6.0637 6.0063 1.0660 1.0618 1.0927 1.1024 1.0873 1.0870 1.0867 1.0862 1.0911 1.0912 1.0959 1.0960 1.0865 1.1014 1.1014 1.0911 1.0975 1.0977
irintensity: 0.1035 0.4509 0.1173 0.2015 3.6150 0.5406 0.8920 1.0636 0.2367 6.2605 0.3279 2.8066 2.7241 3.3193 15.5159 9.4921 0.1014 0.2127 3.9400 1.5943 0.8637 11.5286 17.1987 1.4613 9.8786 3.5111 19.3405 0.2132 0.2508 3.4058 38.7489 8.6139 53.4725 4.4907 41.5769 108.9143 33.9501 8.9574 16.4684 1.4691 8.3084 0.4112 0.4776 11.2768 11.8558 7.3160 21.2018 0.4181 11.5252 0.1101 0.2957 0.0257 0.3568 0.4458 2.0310 5.3161 5.2750 9.2475 5.0550 1.5653 19.6041 22.0021 23.9012 27.0445 0.1205 0.1798 2.8172 6.9046 115.9648 23.4401 10.5688 29.4871 20.9117 24.1603 2.4818 5.1403 7.2182 3.6811 5.7816 28.5554 8.2026 6.5712 29.4780 6.1269 24.2904 30.9303 14.1561 5.5954 19.7696 128.8179 45.6454 0.5431 1.3782 95.0564 8.2619 2.3393 35.7686 63.6473 18.0698 14.0784 17.7856 0.6674 3.9966 0.0471 11.9934 11.3616 38.6193 30.9146 3.4497 27.3074 29.0911 13.5739 6.9213 1.5599
temp: 298.150 k
press: 1.00000 atm
elementType: 8 7 7 6 6 6 6 6 6 6 6 6 6 6 6 6 6 6 6 6 6 6 1 1 1 1 1 1 1 1 1 1 1 1 1 1 1 1 1 1
symmnumber: 1
zpe: 845746.0 jmol-1
zpe.correction: 0.322128 hartree
zpe.thermalcorrener: 0.340551 hartree
zpe.thermalcorrenthalpy: 0.341495 hartree
zpe.thermalcorrgfe: 0.271852 hartree
zpe.sumelectzpe: -917.940892 hartree
zpe.sumelectthermal: -917.922469 hartree
zpe.sumelectthermalent: -917.921525 hartree
zpe.sumelectthermalfe: -917.991168 hartree
dipole: -0.0071 0.7348 3.6079
dipole: 3.6820
quadrupole: -108.6410 -125.4101 -132.4397
quadrupole: 4.0631 -5.8315 0.8068
quadrupole: 13.5226 -3.2465 -10.2761 4.0631 -5.8315 0.8068
hfenergy: -918.2630199 hartree
pointgroup: C01 [X(C19H18N2O1)]
dipole: -0.4364384 0.136828 1.3745121 debye
polarizability: 214.713485|25.3621975|285.9959499|-24.9298096|9.4634383|163.6292488 unknown
InChI: InChI=1S/C19H18N2O/c22-21-14-8-7-13-19(21)20(15-17-9-3-1-4-10-17)16-18-11-5-2-6-12-18/h1-14H,15-16H2
charge 0 multiplicity 1
40 atoms
O  0.556777 -2.369184 -2.120943
N  0.347336 -0.560529 -0.03435
N  0.108767 -2.789343 -0.922482
C  -0.208486 0.199766 -1.203017
C  0.733778 0.254232 1.140017
C  -0.014958 -1.890257 0.171762
C  -1.603659 0.747947 -0.922533
C  1.803844 1.293006 0.806598
C  -0.440377 -2.417939 1.419144
C  -2.74108 -0.098067 -1.007759
C  2.899557 0.963109 -0.030663
C  -1.793037 2.10617 -0.557951
C  1.742494 2.583899 1.38472
C  -0.224784 -4.127753 -0.757513
C  -0.726983 -3.785036 1.592611
C  -4.033203 0.399092 -0.728824
C  3.91854 1.908406 -0.278209
C  -3.085579 2.608982 -0.282706
C  2.765724 3.529851 1.143603
C  -0.6223 -4.649926 0.47667
C  -4.209718 1.755342 -0.36454
C  3.857539 3.194008 0.311021
H  -0.196594 -0.494908 -2.060548
H  0.494254 1.021697 -1.418394
H  1.143317 -0.435197 1.90227
H  -0.145801 0.763306 1.591433
H  -0.582408 -1.723553 2.250889
H  -2.612257 -1.145782 -1.306713
H  2.933998 -0.029882 -0.494414
H  -0.92298 2.773382 -0.503053
H  0.892909 2.850216 2.026656
H  -0.106757 -4.716901 -1.668248
H  -1.05292 -4.159967 2.566909
H  -4.902402 -0.264244 -0.805077
H  4.75913 1.644179 -0.929738
H  -3.216368 3.662665 -0.010425
H  2.707621 4.525374 1.598096
H  -0.847262 -5.717116 0.551091
H  -5.212942 2.143146 -0.154264
H  4.649464 3.926508 0.118476
