program: Gaussian 09
title: 000298387
version: EM64L-G09RevD.01
frameworkgroup: C1[X(C6H6ClNO3)]
method: RPBEPBE
basis: SDD
operation: Freq
keyword: #p
keyword: freq=noraman
keyword: PBEPBE/SDD
title: #p freq=noraman PBEPBE/SDD
converged: YES YES NO NO
title: Mulliken charges:
elementType: Cl O O O N C C C C C C H H H H H H
charge: -0.042053 -0.219203 -0.411753 -0.239634 -0.556327 -0.303660 0.367358 -0.330569 0.186068 -0.103840 -0.168489 0.274461 0.308680 0.292747 0.290383 0.278096 0.377735
chargesum: 0.00000
title: Mulliken charges with hydrogens summed into heavy atoms:
elementType: Cl O O O N C C C C C C
charge: -0.042053 -0.219203 -0.034018 -0.239634 0.026803 -0.029199 0.367358 -0.021889 0.186068 -0.103840 0.109607
polarizability: 1.19351628e+02 -5.36896040e+00 8.54625763e+01 2.92966286e+00 -4.77220062e+00 5.76378196e+01
1716.lowfreq: -10.2380 -6.5864 -0.0012 0.0011 0.0017 0.6466 11.0185 42.0209 94.4709
frequency: 10.6782 42.0166 94.4680 113.0619 210.4175 227.9418 248.2182 286.1226 336.4307 347.9890 386.0416 471.6912 530.6499 583.8795 593.1531 630.6639 662.3539 714.3974 736.6223 744.3222 856.2228 878.6966 903.2237 915.3280 1036.1074 1041.0242 1076.7575 1104.4317 1135.6371 1169.7156 1195.6539 1245.7595 1335.5288 1350.7871 1373.5431 1500.9857 1582.5684 1629.9378 1652.4034 3062.3771 3249.2074 3277.3129 3472.7905 3497.4180 3614.3873
redmass: 7.7489 5.7057 7.2321 6.0533 4.9576 4.5815 6.8814 1.2241 6.8969 4.9814 5.6889 5.7582 1.4733 2.9897 3.0367 1.8401 2.9991 3.5708 1.5172 4.1506 1.3469 5.8376 4.0714 7.8196 2.3482 2.4499 5.9989 2.0301 1.6181 1.9570 1.3476 1.9051 3.2236 1.7824 1.6801 6.4910 6.5043 1.1257 8.1770 1.0849 1.0997 1.1015 1.0442 1.0639 1.1005
irintensity: 2.2583 0.2233 0.4991 0.7591 0.6967 4.7625 4.2375 51.3487 4.8005 6.6668 3.6484 29.6500 200.4051 105.9093 6.4447 110.4745 48.3617 31.4964 29.4187 20.5933 34.6371 23.8927 26.2511 63.1457 245.9685 55.4717 29.1344 20.2358 3.2352 5.9691 14.7618 17.0015 25.5758 51.7773 0.9938 11.3770 19.6532 43.6888 188.6944 4.5750 5.7299 2.2935 7.5616 22.6282 6.3933
temp: 298.150 k
press: 1.00000 atm
elementType: 17 8 8 8 7 6 6 6 6 6 6 1 1 1 1 1 1
symmnumber: 1
zpe: 305818.9 jmol-1
zpe.correction: 0.116480 hartree
zpe.thermalcorrener: 0.127402 hartree
zpe.thermalcorrenthalpy: 0.128347 hartree
zpe.thermalcorrgfe: 0.077079 hartree
zpe.sumelectzpe: -971.865128 hartree
zpe.sumelectthermal: -971.854206 hartree
zpe.sumelectthermalent: -971.853262 hartree
zpe.sumelectthermalfe: -971.904529 hartree
dipole: -2.7226 0.5003 -0.1954
dipole: 2.7751
quadrupole: -60.0179 -72.7633 -68.8933
quadrupole: 3.7654 -1.4646 1.6429
quadrupole: 7.2069 -5.5385 -1.6684 3.7654 -1.4646 1.6429
hfenergy: -971.9816084 hartree
pointgroup: C01 [X(C6H6Cl1N1O3)]
dipole: 1.0444779 -0.1637927 -0.2724761 debye
dipolederiv: -0.501141 0.1797782 0.1775329 0.1846007 -0.1411672 -0.1142446 0.1866766 -0.1129899 -0.1435528 -0.4844579 0.1385315 0.160413 0.0798708 -0.344011 -0.2424666 0.1153804 -0.2319977 -0.3680885 -0.9086468 -0.1570844 0.4923196 -0.1930498 -0.3588723 0.2543609 0.442212 0.2212946 -0.7117777 -0.5890426 -0.1918717 0.0445019 -0.0903148 -0.6322649 -0.2661384 0.1817939 -0.2788349 -0.7542567 -0.5855311 -0.1915051 -0.1093873 -0.0653291 -0.8532699 0.0417086 -0.1349327 0.0560618 -0.2893944 0.512779 -0.1171586 0.0924545 -0.1088118 0.3727477 -0.1596544 0.1161715 -0.157487 0.250225 0.0939027 0.0297335 -0.0241351 -0.0665715 0.0982227 0.2261066 0.129818 0.1926964 0.150297 -0.1584723 0.0811168 0.082756 0.1012063 -0.1517968 -0.0305297 0.0940507 -0.0269669 -0.1619168 1.0500061 0.4882695 -0.5449662 0.5534708 0.7246605 0.2091296 -0.6081805 0.1881893 1.0814955 0.7640644 -0.2890955 -0.2935605 -0.318995 0.1229397 0.2206628 -0.3297238 0.2229482 0.1248249 -0.0639914 -0.0646276 -0.0799704 -0.0999235 0.0300808 0.1490317 -0.107035 0.1415008 0.0503801 0.0358946 0.0104755 0.0274506 0.0337786 0.0539375 -0.0236797 0.0149114 -0.0042316 -0.0393279 0.1627295 -0.0244231 -0.0313524 -0.0314552 0.1374122 -0.0547653 -0.0270657 -0.0534828 0.1347718 0.2732064 0.1029415 -0.0148692 0.0871138 0.2395097 -0.0832925 0.0057371 -0.0251024 0.0796217 0.0031294 0.1077162 0.0486735 0.0518429 0.3258928 0.0584257 -0.0101645 0.0919426 0.1742402 0.0602534 -0.0122625 -0.0155407 -0.0093893 0.1608228 -0.072938 -0.0204708 -0.0756144 0.1474785 0.3353174 -0.0905343 -0.0123202 -0.1080439 0.2151557 -0.1117169 -0.0491786 -0.1479262 0.2749801 unknown
polarizability: 117.5899551|-2.9094984|75.4069204|-10.0241921|14.758529|69.4551481 unknown
InChI: InChI=1S/C6H6ClNO3/c7-3-1-4(11-2-3)5(8)6(9)10/h1-2,5,9H,8H2
charge 0 multiplicity 1
17 atoms
Cl -3.826133 0.912314 1.023659
O  -1.018617 -1.080882 -1.020232
O  3.034952 1.044691 -0.873904
O  1.923253 1.420212 1.133318
N  1.725241 -1.665846 0.510676
C  1.277178 -0.520381 -0.305932
C  -0.203534 -0.294821 -0.17357
C  -0.999728 0.494745 0.641625
C  2.051353 0.756511 0.079961
C  -2.363639 0.183561 0.288075
C  -2.353352 -0.768186 -0.713666
H  1.503409 -0.748965 -1.361026
H  -0.650997 1.202647 1.388811
H  1.569701 -1.559506 1.517083
H  2.644126 -2.04247 0.264716
H  -3.121663 -1.285675 -1.278132
H  3.568851 1.832451 -0.577564
