program: Gaussian 09
title: 000298423
version: EM64L-G09RevD.01
frameworkgroup: C1[X(C19H22N2O3)]
method: RPBEPBE
basis: SDD
operation: Freq
keyword: #p
keyword: freq=noraman
keyword: PBEPBE/SDD
title: #p freq=noraman PBEPBE/SDD
converged: YES YES NO NO
title: Mulliken charges:
elementType: O O O N N C C C C C C C C C C C C C C C C C C C H H H H H H H H H H H H H H H H H H H H H H
charge: -0.322246 -0.475651 -0.221028 -0.101098 -0.506816 0.031668 -0.442766 -0.406680 -0.445984 -0.371458 -0.150139 0.210718 0.395265 0.395889 -0.340300 -0.379350 -0.393979 -0.401556 -0.240134 -0.223900 -0.223817 -0.245109 -0.241589 -0.242000 0.253677 0.254053 0.211952 0.227973 0.208572 0.209356 0.220293 0.200445 0.209042 0.271339 0.273050 0.245639 0.276275 0.285064 0.266992 0.373530 0.224086 0.226351 0.223493 0.226507 0.225676 0.228696
chargesum: 0.00000
title: Mulliken charges with hydrogens summed into heavy atoms:
elementType: O O O N N C C C C C C C C C C C C C C C C C C C
charge: -0.322246 -0.102121 -0.221028 -0.101098 0.037574 0.285345 0.023239 0.022969 -0.009439 0.038030 -0.150139 0.210718 0.395265 0.395889 -0.094661 -0.103075 -0.108916 -0.134563 -0.016048 0.002451 -0.000324 -0.018602 -0.015913 -0.013304
polarizability: 2.35668903e+02 8.91488669e+00 2.39953157e+02 3.70462778e+00 -7.37584159e+00 1.91612282e+02
1716.lowfreq: -3.7465 -1.6660 -0.0007 0.0001 0.0004 11.1832 14.2883 21.5892 30.0665
frequency: 14.0381 21.5114 29.9737 39.8820 50.7129 59.0873 67.0747 108.6195 137.8923 149.6326 157.9035 176.0589 201.7045 213.9520 239.5481 262.2723 272.2687 290.1564 297.4298 334.0388 358.3077 372.4979 402.6412 404.4474 406.4822 411.2497 432.7882 446.7101 468.0555 479.6721 510.1014 550.0711 570.7386 604.7661 615.7336 617.0290 664.5344 694.5378 702.8306 709.8217 737.6377 756.1458 760.8797 787.0763 826.2377 853.3368 863.4188 869.2619 883.2614 898.4144 903.9359 924.5527 934.5381 940.0332 959.8086 967.6812 980.5027 987.6145 989.4839 991.2647 995.8641 998.1909 999.8719 1015.3253 1030.6231 1031.0926 1038.8629 1071.5553 1082.0458 1090.5221 1093.4975 1127.5074 1134.8188 1145.2570 1152.8589 1158.9023 1170.2193 1171.8858 1178.2456 1191.9095 1195.5639 1207.1999 1253.3274 1257.2871 1275.5618 1308.1235 1312.3713 1319.2667 1324.0405 1335.0500 1340.3639 1352.6823 1367.0207 1379.1122 1381.0711 1383.6062 1432.3653 1435.8568 1458.2143 1468.7691 1471.5114 1477.1884 1480.7234 1485.4210 1590.1481 1594.2373 1606.7871 1611.1771 1628.2539 1639.4575 2890.6450 2904.7743 2996.4767 3000.1174 3023.2149 3031.8472 3047.6041 3062.6767 3077.5983 3123.3442 3123.6903 3133.2352 3135.9383 3145.6542 3153.2491 3158.6290 3168.2056 3170.6968 3182.9237 3316.6887 3447.2752 3529.2753
redmass: 5.4346 3.8082 3.9082 4.0005 4.8011 5.0228 5.2909 5.4232 3.8949 1.0873 2.9622 5.2797 4.7085 4.0900 4.3636 2.4768 5.1097 6.0229 3.0504 2.6414 3.0528 3.1918 2.8518 2.9406 4.1618 2.2428 2.4794 4.2423 3.1222 3.3153 3.0012 3.9070 4.4380 6.4153 6.3970 6.4115 5.7850 6.5137 1.9464 1.9132 3.0935 2.2156 1.8867 3.0894 3.3386 1.2531 1.2448 1.5511 2.8668 3.1204 2.1716 2.0908 1.7651 1.5822 2.9395 2.1203 1.3924 1.7963 3.4669 4.6888 1.9720 1.3511 1.3259 5.3314 2.2087 2.2006 1.7417 1.9972 1.6097 2.0869 1.8367 1.7894 3.6166 1.4554 2.6115 2.3205 1.1806 1.0791 2.1746 1.2100 1.1439 1.3170 1.2417 1.2862 1.3125 1.3256 1.3644 1.3612 1.5319 1.4256 1.3752 1.5146 1.4654 7.9770 1.5544 8.6633 2.2067 2.2437 1.0858 1.0807 1.0862 2.1512 2.2224 1.0945 6.1677 6.3560 5.9852 6.0878 1.0708 11.7741 1.0688 1.0668 1.0625 1.0642 1.0886 1.0899 1.0888 1.1008 1.1022 1.0849 1.0847 1.0884 1.0898 1.0935 1.0952 1.0971 1.0966 1.0980 1.0947 1.0447 1.0947 1.0647
irintensity: 0.4318 0.0972 0.4673 1.1597 0.1961 1.0866 1.0421 0.7319 2.5641 59.4055 0.9878 1.4556 1.9836 4.6967 2.2035 2.6560 1.2867 5.1567 2.1232 87.8620 20.7231 4.7441 5.2506 10.0833 1.1255 55.1823 13.6954 8.1830 10.2383 4.5807 4.5239 11.4974 15.9192 18.7758 0.2061 0.2120 21.1188 10.8254 41.8690 54.7573 32.3896 28.2919 32.4808 18.5140 25.9973 0.4683 0.2540 37.5673 22.6723 3.3169 4.9719 53.3691 15.3710 6.1801 105.0359 5.8385 0.3263 0.9327 1.5107 0.4815 52.7814 2.4726 1.0153 34.7026 7.0912 15.0878 24.9533 33.9528 7.9377 10.6326 71.2317 64.7480 360.9848 2.5429 48.4799 7.6743 4.6997 1.1910 11.8636 3.5779 0.7545 2.1127 8.8767 1.8107 0.4309 5.1245 7.0491 0.9481 3.1968 58.3823 3.0852 2.2300 1.2188 0.0113 6.9480 0.9316 3.9880 30.4874 12.6268 6.0644 6.7244 26.2645 15.7060 8.1865 1.3454 0.0607 9.4773 2.4108 45.8482 104.9731 62.2811 66.9906 14.5180 17.5448 77.4269 10.6000 23.9642 23.3447 33.3274 0.3335 0.2329 9.2097 18.8715 18.4871 39.9334 22.6219 11.2684 15.6867 7.0937 6.4102 0.7521 56.9565
temp: 298.150 k
press: 1.00000 atm
elementType: 8 8 8 7 7 6 6 6 6 6 6 6 6 6 6 6 6 6 6 6 6 6 6 6 1 1 1 1 1 1 1 1 1 1 1 1 1 1 1 1 1 1 1 1 1 1
symmnumber: 1
zpe: 983548.3 jmol-1
zpe.correction: 0.374614 hartree
zpe.thermalcorrener: 0.396831 hartree
zpe.thermalcorrenthalpy: 0.397775 hartree
zpe.thermalcorrgfe: 0.320641 hartree
zpe.sumelectzpe: -1070.583702 hartree
zpe.sumelectthermal: -1070.561484 hartree
zpe.sumelectthermalent: -1070.560540 hartree
zpe.sumelectthermalfe: -1070.637675 hartree
dipole: 2.9285 1.0029 -0.4768
dipole: 3.1320
quadrupole: -125.4639 -128.7122 -142.8431
quadrupole: -1.0820 -2.5435 -3.6005
quadrupole: 6.8758 3.6275 -10.5033 -1.0820 -2.5435 -3.6005
hfenergy: -1070.9583154 hartree
pointgroup: C01 [X(C19H22N2O3)]
dipole: 1.1902487 -0.2515483 0.195887 debye
polarizability: 237.6252048|-9.4441864|236.6109767|-2.5935877|-10.8903653|192.9981603 unknown
InChI: InChI=1S/C19H22N2O3/c20-21-13-7-12-17(14-21)24-18(22)19(23,15-8-3-1-4-9-15)16-10-5-2-6-11-16/h1-6,8-11,17,23H,7,12-14,20H2
charge 0 multiplicity 1
46 atoms
O  1.341537 0.138084 -0.468001
O  -0.731728 -0.176769 -1.96385
O  0.167104 0.747184 1.45154
N  5.035388 -0.009568 0.060054
N  6.046888 -0.853693 -0.674257
C  2.644717 0.509668 0.180699
C  2.909045 2.012884 0.009132
C  4.347887 2.331025 0.484789
C  3.708627 -0.338352 -0.530533
C  5.374389 1.417324 -0.212775
C  -1.054734 -0.178948 -0.534771
C  0.17758 0.312819 0.281763
C  -2.238848 0.792669 -0.335097
C  -1.407113 -1.622149 -0.074724
C  -2.925611 0.854701 0.901884
C  -2.003542 -2.488985 -1.024559
C  -2.63273 1.646165 -1.393059
C  -1.189625 -2.087266 1.245953
C  -3.991838 1.762869 1.077862
C  -2.37533 -3.80048 -0.659474
C  -3.705089 2.549735 -1.216161
C  -1.558894 -3.403499 1.607012
C  -4.387282 2.613714 0.019614
C  -2.153648 -4.264564 0.658364
H  2.577993 0.244467 1.251122
H  2.167394 2.598693 0.579195
H  2.800314 2.271872 -1.062219
H  3.499085 -1.411652 -0.367408
H  3.690214 -0.141489 -1.629121
H  4.588926 3.387659 0.267516
H  4.422986 2.190755 1.579563
H  5.396311 1.61295 -1.312667
H  6.38761 1.612453 0.187233
H  6.963765 -0.621951 -0.250768
H  5.835324 -1.834798 -0.415868
H  -2.632895 0.198907 1.726933
H  -2.161716 -2.122792 -2.043291
H  -2.099507 1.583516 -2.344572
H  -0.73151 -1.432667 1.995648
H  0.22319 -0.434769 -2.053536
H  -4.514975 1.803951 2.039828
H  -2.837895 -4.459986 -1.402598
H  -4.005683 3.20245 -2.043752
H  -1.38099 -3.753028 2.630329
H  -5.218032 3.315232 0.157169
H  -2.440359 -5.28384 0.940559
