program: Gaussian 09
title: 000298374
version: EM64L-G09RevD.01
frameworkgroup: C1[X(C14H11N3O2)]
method: RPBEPBE
basis: SDD
operation: Freq
keyword: #p
keyword: freq=noraman
keyword: PBEPBE/SDD
title: #p freq=noraman PBEPBE/SDD
converged: YES YES NO NO
title: Mulliken charges:
elementType: O O N N N C C C C C C C C C C C C C C H H H H H H H H H H H
charge: -0.244702 -0.205154 -0.412967 -0.484984 0.020147 0.124349 -0.055482 0.300715 0.402447 -0.180807 0.079774 -0.502938 -0.780649 0.463227 -0.435941 -0.342456 -0.194387 -0.223056 -0.250803 0.261095 0.340626 0.346757 0.246109 0.302719 0.245047 0.237368 0.247545 0.230923 0.231634 0.233845
chargesum: 0.00000
title: Mulliken charges with hydrogens summed into heavy atoms:
elementType: O O N N N C C C C C C C C C C C C C C
charge: -0.244702 -0.205154 -0.072340 -0.138226 0.020147 0.124349 -0.055482 0.300715 0.402447 -0.180807 0.079774 -0.241843 0.013226 0.463227 -0.198574 -0.094912 0.036537 0.008578 -0.016958
polarizability: 3.39230655e+02 1.81068172e+01 2.01876017e+02 6.68925364e-01 6.59036491e+00 7.94806190e+01
1716.lowfreq: -22.0826 -2.2619 -0.0004 0.0005 0.0007 5.3668 6.5730 33.1219 36.5091
frequency: -21.4618 33.0577 36.4904 82.9305 96.1818 111.1808 166.6163 178.7012 221.6112 231.7870 241.6329 293.9093 298.9414 332.3653 397.6704 405.7891 447.3237 463.8745 476.3858 512.6765 568.4417 598.4655 610.3139 617.8408 645.0675 670.3232 689.7945 691.6986 736.0705 740.2853 744.8977 760.8056 782.6952 821.1489 829.2262 845.5826 872.1930 907.6091 968.4092 974.7363 985.4540 987.1718 990.4770 998.5210 1026.5577 1046.4527 1063.0529 1095.4086 1174.4184 1183.3734 1192.0928 1222.3481 1248.4938 1276.4770 1305.0365 1324.9451 1336.7659 1387.9418 1400.5687 1405.8851 1426.7026 1433.8850 1441.4822 1467.7919 1480.3121 1487.9496 1524.3340 1544.6205 1569.1433 1590.7483 1600.6265 1609.3765 1618.8513 2983.4886 3059.6801 3116.4553 3123.1831 3136.7636 3148.7011 3167.9773 3183.5053 3194.9365 3363.3921 3597.1071
redmass: 1.0366 4.6122 5.3314 5.1303 7.8339 4.5615 5.2248 4.8421 5.8633 4.9102 7.3505 5.1197 4.8264 7.0919 6.5909 2.8994 11.3489 5.0325 5.6754 3.1141 6.6747 6.3163 8.2053 6.6958 4.6351 6.3486 1.1280 1.9344 6.4177 4.6551 5.1052 1.7916 1.3973 3.1380 1.7065 2.5875 1.8731 1.4443 1.4342 3.3754 3.0864 3.4459 1.3251 3.9362 2.1567 1.4944 4.6704 1.6370 1.0527 4.1328 1.1742 5.0880 1.6768 2.5211 2.5615 2.9418 1.4699 6.9110 2.0056 1.4343 4.3299 7.9985 2.4625 1.2141 1.0443 2.3322 2.3826 9.0946 5.2717 6.0465 4.8394 5.8275 6.1881 1.0387 1.0977 1.0976 1.0879 1.0873 1.0938 1.0988 1.0948 1.0911 1.0744 1.0822
irintensity: 0.1146 1.7546 0.7510 0.4829 4.8102 1.3153 1.1723 0.2724 0.5639 1.9397 3.3084 0.9751 0.1682 11.9987 16.7521 0.1092 2.5219 1.8976 0.9264 18.2494 17.0622 6.4252 0.1639 4.3012 1.4385 0.3147 81.5349 56.4485 1.3223 7.5530 8.6017 8.8636 133.2950 0.8554 1.0429 9.9020 39.6076 5.8392 2.8910 63.5273 1.9191 16.0760 0.3340 17.8425 7.6348 5.3434 26.3157 10.2723 0.4928 13.7392 5.0294 147.1124 78.4382 83.5898 2.7384 0.7290 4.0653 5.5151 1.3215 25.5989 136.0042 64.9864 47.9721 9.8518 17.6005 20.8203 488.2229 63.1739 217.4210 106.3517 465.5594 18.0427 34.4511 24.1252 11.2685 0.1322 7.3249 0.2537 22.9825 37.1555 1.7530 4.4060 86.6591 109.2417
temp: 298.150 k
press: 1.00000 atm
elementType: 8 8 7 7 7 6 6 6 6 6 6 6 6 6 6 6 6 6 6 1 1 1 1 1 1 1 1 1 1 1
symmnumber: 1
zpe: 589921.6 jmol-1
zpe.correction: 0.224689 hartree
zpe.thermalcorrener: 0.239538 hartree
zpe.thermalcorrenthalpy: 0.240482 hartree
zpe.thermalcorrgfe: 0.181607 hartree
zpe.sumelectzpe: -853.472936 hartree
zpe.sumelectthermal: -853.458087 hartree
zpe.sumelectthermalent: -853.457143 hartree
zpe.sumelectthermalfe: -853.516018 hartree
dipole: 0.5692 -5.2611 0.5603
dipole: 5.3213
quadrupole: -69.6815 -124.8584 -111.9768
quadrupole: -16.7205 2.2836 4.8847
quadrupole: 32.4907 -22.6861 -9.8046 -16.7205 2.2836 4.8847
hfenergy: -853.6976252 hartree
pointgroup: C01 [X(C14H11N3O2)]
dipole: -0.1903586 2.0840574 -0.0594796 debye
polarizability: 339.6031149|15.122047|197.2947402|-7.6518256|-23.0015395|83.6894364 unknown
InChI: InChI=1S/C14H11N3O2/c1-8-12-13(17-16-8)11(18)7-10(14(12)19)15-9-5-3-2-4-6-9/h2-7,15-16H,1H3
charge 0 multiplicity 1
30 atoms
O  -0.861082 2.288545 -0.151194
O  -1.518914 -3.217081 0.240421
N  -4.5162 -0.115594 0.231896
N  1.296093 0.775126 -0.093234
N  -3.86526 -1.355923 0.287182
C  -2.378661 0.412976 0.083553
C  -2.550839 -1.011483 0.194369
C  -3.675933 0.974343 0.108777
C  0.111017 0.073395 0.008335
C  -1.073526 1.03312 -0.02583
C  -1.391097 -1.949325 0.182658
C  -0.075358 -1.304488 0.088988
C  -4.146428 2.394683 0.032397
C  2.648968 0.365588 -0.020005
C  3.620347 1.235434 -0.593063
C  3.081498 -0.81981 0.635499
C  4.990477 0.918892 -0.526398
C  4.457679 -1.127018 0.69175
C  5.419661 -0.270153 0.110452
H  0.765163 -1.999968 0.045427
H  -5.534065 -0.11217 0.285664
H  1.122693 1.782464 -0.248459
H  -4.691459 2.693104 0.947511
H  -3.274012 3.055575 -0.082366
H  -4.821508 2.554994 -0.8289
H  3.291815 2.152185 -1.097851
H  2.366642 -1.475056 1.137003
H  5.723403 1.597521 -0.976048
H  4.777789 -2.040802 1.204303
H  6.484599 -0.519776 0.157464
