program: Gaussian 09
title: 000298356
version: EM64L-G09RevD.01
frameworkgroup: C1[X(C8H9N3S)]
method: RPBEPBE
basis: SDD
operation: Freq
keyword: #pfreq=noraman
keyword: PBEPBE/SDD
title: #p freq=noraman PBEPBE/SDD
converged: NO YES NO NO
title: Mulliken charges:
elementType: S N N N C C C C C C C C H H H H H H H H H
charge: 0.217547 -0.224565 -0.049552 -0.015142 0.432648 -0.128547 -0.438241 -0.148471 -0.554050 -0.425153 -0.280108 -0.665069 0.269315 0.256725 0.283713 0.283693 0.251539 0.243249 0.230331 0.230330 0.229807
chargesum: 0.00000
title: Mulliken charges with hydrogens summed into heavy atoms:
elementType: S N N N C C C C C C C C
charge: 0.217547 -0.224565 -0.049552 -0.015142 0.432648 -0.128547 -0.168926 0.108254 0.013356 -0.173614 -0.036858 0.025399
polarizability: 1.93668530e+02 8.45573097e+00 1.28737116e+02 -1.08551263e-02 5.01396238e-03 5.59715491e+01
1716.lowfreq: -9.1768 -0.0002 0.0007 0.0013 2.7577 3.9506 22.5332 42.8064 97.5104
frequency: 22.5289 42.7507 97.5104 122.3610 197.1009 201.4974 236.8733 278.6972 284.5870 407.3758 445.7178 475.3804 564.2422 580.2687 619.0299 641.9698 652.5435 720.7256 761.4771 775.5981 778.7184 810.4379 880.5344 908.2407 920.1816 945.3826 993.8947 1014.4067 1048.0082 1069.8151 1150.0623 1172.6529 1233.9034 1246.5434 1252.1746 1280.7311 1282.1543 1329.0968 1339.6078 1353.7838 1397.8400 1418.1668 1444.6918 1451.9185 1471.0076 1483.4497 1503.7579 1590.0945 2988.4497 3052.7556 3084.8643 3086.4606 3133.7425 3137.9770 3170.5889 3198.6882 3236.6638
redmass: 4.7746 1.9216 4.2151 6.1119 6.0295 6.1749 1.0843 6.5084 3.5236 2.6778 7.0777 7.2877 9.3800 4.2562 4.9261 7.3036 6.2593 4.1319 6.3360 1.3014 1.1817 1.4259 6.0004 1.3278 1.4275 4.0182 1.8399 4.3219 1.2151 2.2422 2.1139 1.9657 1.2252 2.4625 2.6993 1.7748 1.9784 1.7724 4.2151 3.0269 1.2069 2.4995 5.4372 1.0875 1.0393 1.0485 4.9828 6.1378 1.0355 1.0597 1.0972 1.1014 1.1088 1.0916 1.0882 1.1001 1.0982
irintensity: 2.2943 0.5252 1.2573 1.4040 1.2702 1.1300 0.0796 6.8634 1.7118 9.6634 1.9081 4.6086 1.7768 1.4175 13.1777 6.9166 7.5162 9.2191 6.4417 3.6862 22.6447 61.4515 26.1744 9.1633 0.5357 2.4082 36.7113 24.9842 0.2408 4.5042 1.9761 5.3124 0.6336 9.0438 18.1173 3.0487 90.5085 10.2339 107.1671 35.5032 21.3075 9.6668 5.3658 13.8847 16.1110 8.4505 11.6170 21.6570 29.1468 4.1935 23.1780 15.8753 19.0294 10.7869 7.7051 5.7504 2.4768
temp: 298.150 k
press: 1.00000 atm
elementType: 16 7 7 7 6 6 6 6 6 6 6 6 1 1 1 1 1 1 1 1 1
symmnumber: 1
zpe: 418631.3 jmol-1
zpe.correction: 0.159448 hartree
zpe.thermalcorrener: 0.170516 hartree
zpe.thermalcorrenthalpy: 0.171460 hartree
zpe.thermalcorrgfe: 0.120673 hartree
zpe.sumelectzpe: -871.668825 hartree
zpe.sumelectthermal: -871.657757 hartree
zpe.sumelectthermalent: -871.656812 hartree
zpe.sumelectthermalfe: -871.707600 hartree
dipole: 2.4416 -0.3914 0.0004
dipole: 2.4728
quadrupole: -78.5128 -72.4249 -80.9212
quadrupole: -2.9493 0.0071 0.0004
quadrupole: -1.2265 4.8614 -3.6350 -2.9493 0.0071 0.0004
hfenergy: -871.828273 hartree
pointgroup: C01 [X(C8H9N3S1)]
dipole: -0.9529262 0.196043 0.0001424 debye
dipolederiv: -0.7321036 0.015758 0.0000515 0.2765781 -0.0840876 0.0000263 0.0001625 -0.0000833 -0.0793016 -0.1605216 0.3231899 0.0001335 -0.1976693 -0.4371501 -0.0000712 0.0001583 0.0001457 0.065905 -0.529836 -0.1244487 -0.0001191 0.3265333 -0.3064095 0.0000604 -0.0003927 0.0001599 -0.2126705 -0.5387599 -0.1865384 -0.000097 -0.0614509 -0.4183311 0.0000392 -0.0001365 -0.0001099 -0.2552748 -0.6401413 -0.1091579 -0.0000562 0.2873346 0.090796 0.0001593 -0.0003604 -0.0000994 0.1016412 0.9235011 -0.463899 0.0001467 -0.8301053 0.2395399 -0.000206 0.0001669 0.0000805 -0.0432929 0.1129952 0.1404808 -0.0000674 -0.1217855 0.1333273 0.0000897 0.0000972 -0.0004068 -0.1867582 0.016548 -0.0725008 -0.0000157 0.1389536 0.0304266 -0.0000021 0.0000158 -0.0000138 -0.0930038 0.6461019 0.1450111 -0.0002729 0.3311732 0.0970969 -0.0000591 -0.0003219 -0.0000665 0.1376093 0.5943933 0.0805988 0.0001564 0.072827 0.3305756 -0.0000273 0.0002249 0.0001618 -0.0316366 0.1761931 0.1783103 0.0001461 -0.1076292 0.3103755 -0.0001208 0.0000618 -0.0000101 -0.120778 -0.1859198 0.0531776 0.0000524 -0.1409519 0.0422836 0.0000651 0.0002265 -0.0000043 0.0719859 0.0703831 0.036258 0.0000387 0.0523975 -0.0017809 -0.0000218 0.0000784 0.0001905 0.1935259 0.0510263 0.0936378 -0.0000794 0.0362691 0.0490881 0.0000147 0.00001 0.0000525 0.189742 -0.0167773 0.0012151 0.0211968 -0.0750114 -0.0063147 -0.083401 0.0333528 -0.0738771 -0.0164069 -0.0168858 0.0012722 -0.0211938 -0.0749925 -0.0061278 0.0834411 -0.0332563 0.073875 -0.016592 0.0446962 0.0590363 -0.0000256 0.0800879 -0.0353637 0.0000354 0.0000387 -0.0000263 0.1302437 0.0825087 -0.0732622 -0.0000135 -0.0468821 -0.0660928 0.0000181 -0.0000389 0.0000098 0.1618147 0.1175369 -0.0051611 -0.0118458 0.0761355 0.0159736 -0.1109085 0.0366097 -0.1117709 -0.0607198 0.1175208 -0.0050372 0.0117045 0.076196 0.0162548 0.1107498 -0.0368762 0.1116744 -0.0609873 -0.1324593 -0.0879408 0.0001599 -0.0980077 0.0059204 0.0001187 0.0001793 0.0001183 0.1249547 unknown
polarizability: 194.2853349|5.573951|128.1203108|0.0106244|-0.0054859|55.9715491 unknown
InChI: InChI=1S/C8H9N3S/c1-2-12-8-10-6-7-5-9-3-4-11(7)8/h3-6H,2H2,1H3
charge 0 multiplicity 1
21 atoms
S  -2.12512 1.072543 -0.000971
N  0.563304 0.279059 -0.000342
N  -0.876057 -1.46935 0.000101
N  3.391777 0.433799 0.00058
C  1.359063 -0.925637 0.000118
C  -0.768139 -0.115226 -0.000624
C  0.418103 -1.975924 -0.000592
C  1.185628 1.531582 -0.000314
C  -3.573556 -0.164863 0.000515
C  2.778283 -0.763307 0.000622
C  2.568021 1.569993 0.000147
C  -4.890611 0.621232 0.000639
H  0.605383 -3.046636 -0.000679
H  0.547322 2.416845 -0.000629
H  -3.453501 -0.795426 -0.893325
H  -3.452652 -0.794283 0.895051
H  3.418777 -1.652165 0.00069
H  3.08676 2.531551 0.000175
H  -4.984358 1.260294 0.896431
H  -4.985214 1.259129 -0.895894
H  -5.735612 -0.091211 0.001503
