program: Gaussian 09
title: 000027049
version: EM64L-G09RevD.01
frameworkgroup: C1[X(C10H13NO2)]
method: RPBEPBE
basis: SDD
operation: Freq
keyword: #p
keyword: freq=noraman
keyword: PBEPBE/SDD
title: #p freq=noraman PBEPBE/SDD
converged: YES YES NO NO
title: Mulliken charges:
elementType: O O N C C C C C C C C C C H H H H H H H H H H H H H
charge: -0.417145 -0.239843 -0.698254 -0.574717 -0.378882 0.514012 -0.490392 -0.388961 -0.419641 -0.414787 -0.411181 0.480286 0.194281 0.195250 0.234858 0.219236 0.233333 0.245713 0.257465 0.238581 0.223479 0.211421 0.210411 0.300474 0.301242 0.373760
chargesum: 0.00000
title: Mulliken charges with hydrogens summed into heavy atoms:
elementType: O O N C C C C C C C C C C
charge: -0.043386 -0.239843 -0.096537 -0.144608 0.073687 0.514012 0.012786 -0.150381 -0.196163 -0.203366 -0.200770 0.480286 0.194281
polarizability: 1.76907655e+02 6.07619078e+00 1.17583579e+02 9.38009210e+00 2.45229560e+00 6.94553616e+01
1716.lowfreq: -6.2614 -3.2482 -0.0009 -0.0007 -0.0006 12.8163 27.7076 28.7355 31.0023
frequency: 27.6488 28.4506 30.2866 76.5668 96.6724 185.2266 221.5796 271.8445 298.6388 310.8737 356.3907 366.2578 393.1588 409.5463 447.8062 495.1860 507.4192 544.9769 590.5489 639.4718 643.9259 721.8398 744.2122 772.3478 813.8946 818.8807 827.5627 833.4391 870.3030 934.0998 953.9507 996.4281 1001.2972 1015.0052 1029.9887 1051.4168 1081.8872 1127.7250 1162.9131 1187.3071 1202.0894 1220.6374 1252.3099 1280.7548 1297.5156 1310.1150 1321.4374 1352.1504 1361.8472 1385.9545 1432.6199 1434.6076 1460.6608 1480.8960 1519.5671 1582.7669 1632.0169 1643.6641 1666.2878 2977.1274 2989.0139 3001.8736 3029.7763 3045.2847 3067.4268 3104.3916 3107.4129 3127.1783 3134.3941 3509.0963 3569.5898 3710.2511
redmass: 5.8142 4.9035 5.1100 3.8273 4.3554 3.8861 2.2317 3.4986 2.7141 1.2111 1.0441 4.9236 2.5415 2.7197 4.8275 2.1961 2.6357 3.0581 3.4386 6.5263 1.3542 3.3048 1.6328 3.1741 1.6021 1.7582 2.3659 2.7456 2.3338 1.3900 1.3543 1.8093 2.7678 1.8770 2.2346 2.4872 1.7918 1.3017 1.2517 1.0969 1.2612 2.3538 1.6415 1.2656 1.3056 3.2234 1.2539 1.4471 1.8130 5.3034 1.8689 1.4360 1.0823 1.1010 3.1140 6.6473 1.7708 2.2093 7.9661 1.0597 1.0619 1.0622 1.0991 1.0979 1.1030 1.0866 1.0867 1.0962 1.0972 1.0639 1.0447 1.1040
irintensity: 0.7522 0.7381 0.7191 2.8226 0.8385 3.0299 1.7660 1.1994 3.7221 315.5524 0.9457 6.5898 0.9675 0.0329 26.6363 14.5204 36.4644 12.2191 10.7579 0.5658 131.9642 1.7020 10.0338 18.6603 19.8625 19.1846 14.0489 21.5052 5.7485 0.5441 0.0304 0.5247 0.6190 23.7370 224.7540 53.3265 52.7533 19.3290 28.0837 13.9725 5.1772 0.1545 10.0437 4.2020 5.3443 63.6262 0.6054 1.3047 50.4500 11.1228 11.8276 24.1337 7.1139 9.6279 141.4991 2.8426 3.7093 261.7694 185.9716 28.1025 30.8902 24.9767 5.6645 10.8380 31.7359 9.6475 30.8922 50.3591 2.1097 20.4530 63.9619 18.8047
temp: 298.150 k
press: 1.00000 atm
elementType: 8 8 7 6 6 6 6 6 6 6 6 6 6 1 1 1 1 1 1 1 1 1 1 1 1 1
symmnumber: 1
zpe: 556847.8 jmol-1
zpe.correction: 0.212092 hartree
zpe.thermalcorrener: 0.225285 hartree
zpe.thermalcorrenthalpy: 0.226229 hartree
zpe.thermalcorrgfe: 0.170133 hartree
zpe.sumelectzpe: -593.108187 hartree
zpe.sumelectthermal: -593.094994 hartree
zpe.sumelectthermalent: -593.094050 hartree
zpe.sumelectthermalfe: -593.150146 hartree
dipole: 1.3744 -0.8960 0.5870
dipole: 1.7425
quadrupole: -51.5778 -73.9093 -80.2118
quadrupole: 2.0054 3.2293 0.3394
quadrupole: 16.9885 -5.3430 -11.6455 2.0054 3.2293 0.3394
hfenergy: -593.3202791 hartree
pointgroup: C01 [X(C10H13N1O2)]
dipole: 0.5367014 -0.3622227 0.2252465 debye
dipolederiv: -1.3659061 -0.1889155 -0.2068444 -0.1185698 -0.2670067 -0.0783917 -0.3115633 -0.0968061 -0.4850546 -0.7869938 -0.0101672 -0.0999316 -0.2678737 -0.8568709 0.0339206 -0.0333121 0.1125115 -0.3416201 -1.5776843 -0.2687904 -0.11488 -0.2792358 -0.1455483 0.0679021 -0.1532362 0.0617538 -0.7675016 0.0315809 0.0061359 0.0110918 0.0076472 0.1602287 0.0134831 0.1367306 0.0510814 0.1063655 0.0489237 -0.0427953 0.0042245 -0.0219428 0.0980409 -0.0018866 -0.0915923 -0.0514376 0.0785002 0.11622 0.0559242 0.0131045 0.0716812 -0.2543958 -0.0298969 0.0211517 -0.0338564 -0.1295312 -0.0855638 0.0232667 -0.0341894 0.1445562 -0.1546065 0.1470456 -0.0167366 0.1770285 0.0356123 0.1091113 0.142064 0.0604963 -0.0512765 0.1602779 0.0416581 0.0249208 0.0665636 -0.1140431 0.1667243 -0.1567427 0.0224147 0.0060756 0.1350975 0.0539127 0.0497562 0.0212575 -0.1315862 -0.4300463 -0.1765708 -0.0388808 0.3014317 0.104626 0.079422 0.0263355 0.0297587 -0.2251175 -0.3313409 0.0160627 0.005747 -0.4735998 -0.0059798 -0.0105103 -0.0886393 0.0418723 -0.2316269 1.6151724 0.2935511 0.2115087 0.3093625 -0.001025 0.0119562 0.2436867 0.0176119 0.164654 1.6642961 0.1328896 0.3875461 0.2219115 1.0555226 -0.1321012 0.4612547 -0.183786 0.3588917 0.005614 -0.0228682 -0.0024726 -0.0741763 -0.1067807 -0.1283316 -0.0152754 -0.0755177 -0.0043101 -0.0159321 0.0246897 -0.0602705 0.0590938 -0.0200163 0.1028301 -0.0794113 0.0508876 -0.0049306 0.0111595 0.0806767 -0.0459833 0.0561404 -0.040619 0.1208355 -0.0335976 0.080095 -0.0170104 0.0650967 -0.0341878 -0.0060918 -0.0531441 -0.0447048 -0.117875 -0.0004193 -0.059455 0.0152975 0.0556287 0.0084612 -0.0406149 -0.0298504 -0.0113372 -0.0740781 -0.0756842 -0.113795 0.0328278 -0.0522348 0.002048 0.0811123 0.0060235 0.0961566 0.0208483 0.1095645 0.0426763 -0.0293621 0.0046481 0.1122444 -0.0079192 0.117203 -0.0061559 -0.0136698 -0.0081039 -0.0113953 0.1315316 0.0668016 -0.0861624 -0.031734 -0.0740561 -0.0976019 -0.0470044 -0.0279717 -0.0496711 0.1257555 0.0144252 -0.0917227 -0.0306126 -0.0858662 -0.1049785 -0.048874 -0.0357989 -0.0520792 0.1541208 -0.07142 0.1209916 -0.0066307 0.1133255 -0.0320376 -0.019966 -0.0143983 -0.018907 0.1631085 0.207141 0.0121919 -0.0228208 -0.0012219 0.1127831 -0.0427138 -0.0221261 -0.0419458 0.3792153 0.1960264 0.0296514 -0.0210071 0.0445383 0.1237488 -0.0379838 -0.0172529 -0.0376392 0.3802737 0.3385524 0.0180739 -0.0263622 0.0718231 0.1031828 0.0894689 -0.0482813 0.0731935 0.3555402 unknown
polarizability: 176.8223328|5.4040322|117.3382083|10.4113735|3.7694338|69.786055 unknown
InChI: InChI=1S/C10H13NO2/c11-9-6-4-8(5-7-9)2-1-3-10(12)13/h4-7,12H,1-3,11H2
charge 0 multiplicity 1
26 atoms
O  -5.079622 0.021912 -0.367836
O  -3.329717 1.521152 -0.103508
N  4.879562 0.442981 0.309105
C  -0.76376 -0.560639 -0.556605
C  -1.538948 -0.620067 0.789422
C  0.722447 -0.302217 -0.359706
C  -3.053148 -0.844977 0.607083
C  1.203167 1.00584 -0.088426
C  1.674099 -1.352268 -0.399669
C  2.570326 1.260251 0.133561
C  3.047316 -1.118462 -0.17938
C  3.519289 0.197366 0.092564
C  -3.771651 0.357859 0.023154
H  -0.913883 -1.515916 -1.098364
H  -1.208271 0.240463 -1.177769
H  -1.124791 -1.436768 1.410884
H  -1.371568 0.323004 1.342017
H  -3.261457 -1.718919 -0.038741
H  -3.537598 -1.066285 1.579402
H  0.491833 1.841308 -0.058028
H  1.336405 -2.374969 -0.612601
H  2.912026 2.283635 0.334692
H  3.759694 -1.952232 -0.222548
H  5.557077 -0.312292 0.274165
H  5.21437 1.382314 0.499529
H  -5.531698 0.835625 -0.722194
