program: Gaussian 09
title: 000298375
version: EM64L-G09RevD.01
frameworkgroup: C1[X(C21H17N3O2)]
method: RPBEPBE
basis: SDD
operation: Freq
keyword: #p
keyword: freq=noraman
keyword: PBEPBE/SDD
title: #p freq=noraman PBEPBE/SDD
converged: NO YES NO NO
title: Mulliken charges:
elementType: O O N N N C C C C C C C C C C C C C C C C C C C C C H H H H H H H H H H H H H H H H H
charge: -0.246945 -0.208389 -0.186184 -0.007838 -0.485709 0.105701 0.347757 -0.069098 -0.538721 -0.187566 0.401941 0.072262 -0.783972 0.475696 -0.500406 -0.429080 -0.364113 0.462928 -0.217244 -0.218849 -0.236585 -0.437499 -0.341610 -0.194727 -0.223594 -0.251722 0.268207 0.221547 0.260675 0.299335 0.237166 0.258886 0.346546 0.228827 0.267776 0.230368 0.233159 0.233427 0.237048 0.246342 0.230309 0.230778 0.233171
chargesum: 0.00000
title: Mulliken charges with hydrogens summed into heavy atoms:
elementType: O O N N N C C C C C C C C C C C C C C C C C C C C C
charge: -0.246945 -0.208389 -0.186184 -0.007838 -0.139162 0.105701 0.347757 -0.069098 -0.048968 -0.187566 0.401941 0.072262 0.013204 0.475696 -0.241520 -0.200253 -0.096337 0.462928 0.013124 0.014310 -0.003158 -0.200452 -0.095268 0.035582 0.007184 -0.018551
polarizability: 4.43398537e+02 3.63842917e+00 2.51853719e+02 -2.57574805e+01 6.32306508e+00 1.63053550e+02
1716.lowfreq: -3.9616 -1.8119 -0.0004 0.0007 0.0007 7.3749 17.6752 19.9960 29.9759
frequency: 17.4095 19.2102 29.9680 37.4005 43.7302 79.2854 89.7036 102.4061 114.5212 139.4319 158.1596 184.5140 199.9005 207.2530 233.2396 249.2338 269.6198 295.2670 315.1130 324.7257 366.1370 403.1056 406.8440 412.0072 447.5237 465.0776 466.1089 508.5081 514.5203 557.5624 574.9074 597.5097 612.1731 617.9724 622.3927 644.5871 673.5982 691.4924 706.4514 731.0797 735.4701 742.9961 750.4140 761.4313 783.1027 809.6992 809.7758 820.2846 831.2767 849.4360 858.7947 869.5321 906.6774 910.4779 942.4136 968.2741 976.1571 982.3183 985.9807 989.5410 989.7082 1002.3516 1009.1155 1026.2457 1026.7231 1047.2236 1055.5737 1092.6219 1094.7897 1139.4555 1174.1346 1174.3653 1189.3911 1190.5444 1202.7350 1213.7366 1220.4119 1253.0565 1270.1603 1296.9731 1318.2561 1323.3211 1336.4496 1349.0011 1386.6013 1388.2054 1390.6824 1402.9008 1427.1100 1437.5440 1441.5358 1444.4829 1452.5646 1473.6868 1477.6986 1485.9790 1488.4799 1521.8553 1542.5689 1559.4527 1586.7642 1596.4689 1600.4232 1609.5372 1614.4596 1619.2168 2978.5469 3023.2160 3054.3307 3084.5126 3114.0743 3115.5856 3122.7904 3128.1436 3135.8483 3137.9543 3148.1556 3150.1419 3166.4973 3167.8527 3183.1930 3194.9895 3357.3170
redmass: 5.7030 5.3434 4.0593 4.3530 6.0095 4.8119 5.4683 1.9164 1.5700 7.9699 5.2739 5.1840 5.4186 4.1796 4.8958 6.3760 5.5783 5.2520 2.3604 5.7527 7.2784 2.8327 2.8971 4.3030 11.3998 3.8627 4.7122 4.2348 3.4565 6.2686 5.6206 6.2293 6.3615 6.5646 6.0136 4.9328 5.6258 1.9606 2.1009 2.7600 5.2446 6.3700 2.1651 1.9326 1.4139 3.6284 3.6202 2.8998 1.6028 2.8940 1.2470 1.9778 1.4549 1.6920 1.9503 1.4221 2.3372 1.3894 4.8068 1.3847 5.3491 1.3272 4.1212 2.1944 2.2103 1.5000 2.3158 1.5959 1.5907 3.9634 1.0531 1.0562 1.1154 1.1611 3.3235 3.3398 4.4556 1.5440 1.6204 3.4418 1.4282 2.7198 1.4721 1.4171 6.1836 6.4967 3.8345 1.2884 6.4822 4.3711 2.6793 2.1212 1.1123 1.2803 1.1744 1.9510 2.3459 2.6453 7.5049 6.0393 7.2423 6.0369 4.5406 5.8859 6.0213 6.1936 1.0391 1.0600 1.0968 1.1032 1.0887 1.0974 1.0878 1.0866 1.0873 1.0913 1.0938 1.0961 1.1015 1.0991 1.0936 1.0919 1.0743
irintensity: 1.4337 0.0574 0.1286 0.6368 0.6668 0.4197 1.1981 3.2299 0.8211 0.4633 0.5762 3.0406 0.0714 0.7998 2.4384 1.0677 7.2892 0.3560 1.3812 8.5054 12.5658 0.7791 0.2713 5.3660 3.8730 16.2653 2.5084 6.5693 16.7361 12.9282 8.6804 0.6782 0.7000 0.4459 3.3013 7.4130 9.6076 35.4447 43.6805 62.4927 3.7573 1.2529 39.0928 4.7797 114.9091 2.6661 12.0246 1.1655 1.2096 8.5753 0.3069 36.7451 7.4279 7.6611 1.0363 2.1690 56.8094 0.5823 4.2595 0.3361 1.1940 0.2412 36.6011 2.1696 12.4092 4.4580 16.9548 16.1501 7.3596 56.7123 0.6887 0.1923 3.8597 11.2629 6.9281 15.0976 193.5632 98.5363 17.8922 28.1748 23.0402 4.2915 8.7639 25.1560 19.9085 11.0662 47.9503 30.0873 164.2293 37.5351 55.9584 6.9190 27.2787 1.4767 26.7621 12.1353 18.3486 545.8163 60.9906 186.2683 211.0988 6.1777 450.7895 24.5886 2.3462 31.1153 17.2837 24.9494 8.6157 2.1429 10.2077 0.2790 7.7195 0.3049 0.4440 8.9992 23.2320 27.6015 25.6864 39.7072 2.5431 4.1359 88.0085
temp: 298.150 k
press: 1.00000 atm
elementType: 8 8 7 7 7 6 6 6 6 6 6 6 6 6 6 6 6 6 6 6 6 6 6 6 6 6 1 1 1 1 1 1 1 1 1 1 1 1 1 1 1 1 1
symmnumber: 1
zpe: 871009.5 jmol-1
zpe.correction: 0.331750 hartree
zpe.thermalcorrener: 0.353532 hartree
zpe.thermalcorrenthalpy: 0.354476 hartree
zpe.thermalcorrgfe: 0.277868 hartree
zpe.sumelectzpe: -1123.341107 hartree
zpe.sumelectthermal: -1123.319325 hartree
zpe.sumelectthermalent: -1123.318381 hartree
zpe.sumelectthermalfe: -1123.394989 hartree
dipole: 1.7993 -4.8087 1.2060
dipole: 5.2741
quadrupole: -108.5960 -161.9279 -148.2567
quadrupole: -6.8625 -3.3123 12.6958
quadrupole: 30.9975 -22.3344 -8.6632 -6.8625 -3.3123 12.6958
hfenergy: -1123.6728568 hartree
pointgroup: C01 [X(C21H17N3O2)]
dipole: -0.5940043 -1.12958 -1.6360753 debye
polarizability: 441.8566871|27.2802996|221.0206085|-17.5107326|42.8423133|195.4285099 unknown
InChI: InChI=1S/C21H17N3O2/c1-14-19-20(23-24(14)13-15-8-4-2-5-9-15)18(25)12-17(21(19)26)22-16-10-6-3-7-11-16/h2-12,22H,13H2,1H3
charge 0 multiplicity 1
43 atoms
O  1.235387 -1.818406 -1.279936
O  0.445002 1.667256 2.976581
N  -2.428971 -0.860393 0.965641
N  -1.810937 0.075347 1.818329
N  3.2840 -0.397768 -0.437499
C  -0.309733 -0.828679 0.305834
C  -1.567126 -1.421064 0.040414
C  -0.515731 0.078092 1.401185
C  -3.881247 -1.073951 1.106391
C  0.98281 -1.010236 -0.320048
C  2.109847 -0.149812 0.246097
C  0.597202 0.882567 1.982088
C  -1.979472 -2.431112 -0.984914
C  -4.705765 -0.296164 0.082639
C  1.898312 0.703589 1.32567
C  -5.639929 -0.965556 -0.744019
C  -4.5601 1.110471 -0.029162
C  4.567133 0.193781 -0.366563
C  -6.424062 -0.240911 -1.67187
C  -5.338556 1.832848 -0.959194
C  -6.273156 1.159778 -1.782147
C  5.656336 -0.558846 -0.892412
C  4.810149 1.49912 0.142495
C  6.959317 -0.025799 -0.893264
C  6.121817 2.019851 0.13929
C  7.20397 1.26626 -0.369302
H  -4.122594 -0.751425 2.13343
H  -4.089041 -2.155643 1.027188
H  -2.782917 -2.039516 -1.636127
H  -1.108536 -2.687418 -1.606824
H  -2.35522 -3.359874 -0.513944
H  2.714112 1.270968 1.777946
H  3.160537 -1.161403 -1.123936
H  -5.759602 -2.053569 -0.661631
H  -3.839192 1.631062 0.612458
H  -7.146094 -0.767199 -2.306045
H  -5.220654 2.919094 -1.039864
H  -6.877783 1.722861 -2.501723
H  5.473861 -1.565188 -1.289097
H  3.987831 2.124571 0.494846
H  7.785223 -0.620834 -1.297971
H  6.293857 3.028838 0.530077
H  8.218019 1.679007 -0.363713
