program: Gaussian 09
title: 000027115
version: EM64L-G09RevD.01
frameworkgroup: C1[X(C20H22N4O2)]
method: RPBEPBE
basis: SDD
operation: Freq
keyword: #p
keyword: freq=noraman
keyword: PBEPBE/SDD
title: #p freq=noraman PBEPBE/SDD
converged: YES YES NO NO
title: Mulliken charges:
elementType: O O N N N N C C C C C C C C C C C C C C C C C C C C H H H H H H H H H H H H H H H H H H H H H H
charge: -0.274108 -0.262104 -0.142983 -0.273692 -0.231912 -0.706213 0.058351 0.360987 0.136636 -0.386953 0.445042 -0.766557 -0.640886 0.052634 -0.672379 0.338024 -0.358341 -0.390582 -0.215729 -0.212193 -0.540324 -0.429018 -0.252229 0.492976 -0.192704 -0.426044 0.244624 0.295494 0.218930 0.246732 0.288228 0.267507 0.238862 0.252270 0.199571 0.223847 0.235912 0.287404 0.260555 0.228482 0.226543 0.229490 0.263010 0.229402 0.223058 0.218479 0.305281 0.306621
chargesum: 0.00000
title: Mulliken charges with hydrogens summed into heavy atoms:
elementType: O O N N N N C C C C C C C C C C C C C C C C C C C C
charge: -0.274108 -0.262104 -0.142983 -0.273692 -0.231912 -0.094310 0.058351 0.360987 0.136636 0.153166 0.445042 -0.012667 0.117752 0.052634 -0.013049 0.338024 -0.070936 -0.130027 0.012753 0.014350 -0.310834 -0.166008 -0.022828 0.492976 0.030355 -0.207565
polarizability: 3.94795781e+02 -9.38630370e-01 1.99235151e+02 5.69018974e+00 8.70009870e+00 2.08984358e+02
1716.lowfreq: -4.2227 -0.0008 -0.0005 -0.0001 1.4212 6.4872 18.5087 31.4340 36.1006
frequency: 18.0572 31.4308 36.0728 53.8473 66.8856 76.2664 84.8048 95.6462 113.5060 131.6890 142.5922 162.7407 170.8119 171.5154 179.2227 195.3032 218.9460 227.4079 253.3500 269.9517 284.2741 306.6937 313.8509 335.6599 347.2792 361.9240 365.2002 374.8548 392.3130 399.7521 409.3316 431.7042 450.1428 479.7049 503.5313 526.5816 543.4770 577.6910 599.1058 613.8828 621.3684 628.3771 647.4047 664.3956 692.8524 696.4063 703.9340 722.9430 735.2891 761.8005 793.8389 802.8250 829.6113 842.9311 871.0183 880.8964 888.6655 911.1094 919.1404 956.8899 970.5705 971.5905 982.3643 985.5765 990.3683 1011.6400 1026.4040 1033.1038 1038.3436 1044.8905 1051.7818 1075.6063 1084.3983 1093.5558 1109.5073 1112.7108 1138.2935 1166.8432 1171.7972 1172.5349 1179.1179 1187.4388 1197.0114 1255.0615 1286.5404 1306.8166 1318.0428 1328.2173 1333.9807 1360.3555 1372.3900 1384.7483 1387.5494 1390.8475 1391.8288 1416.7180 1432.6893 1444.3441 1449.8035 1451.8403 1465.0094 1471.0773 1473.1737 1477.8089 1484.0966 1486.7891 1490.5263 1497.0715 1547.2682 1588.9889 1591.4368 1605.6653 1619.2529 1620.9475 1623.4046 1641.8980 2980.6868 2982.1929 2984.5024 3009.1370 3069.5926 3073.1871 3081.9272 3089.5585 3095.1954 3106.4558 3119.3072 3126.6951 3127.5920 3128.2714 3139.0106 3144.5312 3152.3770 3165.5227 3173.2072 3191.4712 3568.3448 3708.6870
redmass: 4.9527 5.5501 4.3672 3.9366 5.1584 4.8416 4.3749 3.8735 3.4354 4.6186 3.0123 2.6179 3.5181 1.4130 1.1495 1.1238 3.2687 3.9548 4.2844 4.5224 2.9095 6.1146 2.7953 3.7615 1.2789 2.3093 1.3017 3.7941 4.3696 4.3091 2.9559 4.1701 4.4296 4.4549 3.4241 6.1642 4.6008 5.4276 5.5899 6.2315 5.8317 5.7722 5.1022 4.1651 2.4437 2.5155 4.8216 3.3559 4.3790 1.7035 1.3968 1.6712 3.6540 1.2692 3.7084 1.5858 1.5362 1.5698 2.4335 2.2738 1.3636 1.3608 5.5233 4.3298 1.4323 3.4056 1.6702 1.8917 1.8902 1.7516 2.5973 2.0644 2.0593 1.8493 1.4997 1.7503 1.9619 4.6482 1.7537 1.1405 1.0979 1.1480 3.6834 1.9433 2.1807 1.5725 1.7146 2.4267 2.5207 2.1086 1.5413 5.3273 1.3265 6.4597 1.4988 2.2051 1.1995 2.0836 2.3685 1.4326 1.0468 1.0707 1.1210 1.0577 1.7464 1.9398 1.6901 1.1448 8.9608 6.4571 6.2526 6.6571 8.8521 7.4936 4.8774 1.2679 1.0365 1.0404 1.0371 1.0679 1.0961 1.0971 1.0995 1.0940 1.1001 1.0982 1.0876 1.0904 1.0919 1.0945 1.0891 1.0932 1.0942 1.0996 1.0965 1.0959 1.0449 1.1040
irintensity: 0.2071 1.5692 2.0253 2.9189 3.3798 3.5098 1.2589 1.4702 0.8457 0.8050 1.8915 9.5933 0.4400 1.5397 0.4421 0.2881 6.7356 0.2739 0.6583 1.0208 5.6913 9.7487 10.7410 16.9215 264.1807 4.8134 6.8144 14.0490 0.3647 12.4676 0.8326 7.0059 9.4669 14.3598 9.4427 0.2547 12.7916 9.9542 1.3462 0.8172 7.7119 24.1262 9.4530 11.6262 11.2370 19.2199 23.2227 25.3079 22.4859 73.6014 44.3667 40.9756 22.8606 0.4987 5.2869 16.9341 9.9594 4.6536 4.3870 9.9945 0.9332 1.3662 9.7586 0.4375 0.5007 14.5122 6.1551 4.4475 5.8176 3.4712 10.1133 82.5577 17.8728 31.5782 10.5588 66.7754 34.4333 38.4464 9.0159 1.5646 2.5361 0.5428 32.2223 177.8992 112.1806 25.5528 66.6064 21.3696 153.6653 140.8223 112.7616 10.2428 29.9932 6.1902 37.6989 6.5496 34.0021 20.6311 25.3360 26.7387 4.9017 37.4059 12.5559 0.8899 95.4055 79.7509 30.3974 8.8158 206.3736 4.7661 14.5878 116.7746 45.2853 162.5257 79.1555 236.6313 28.2082 45.2858 21.8786 21.2871 5.6536 32.9259 27.2400 9.4345 25.4412 19.9064 12.3779 15.1869 10.0465 4.1353 11.7220 28.2919 27.5234 24.4452 8.2213 1.6677 62.6661 19.7971
temp: 298.150 k
press: 1.00000 atm
elementType: 8 8 7 7 7 7 6 6 6 6 6 6 6 6 6 6 6 6 6 6 6 6 6 6 6 6 1 1 1 1 1 1 1 1 1 1 1 1 1 1 1 1 1 1 1 1 1 1
symmnumber: 1
zpe: 1010233.1 jmol-1
zpe.correction: 0.384777 hartree
zpe.thermalcorrener: 0.409710 hartree
zpe.thermalcorrenthalpy: 0.410655 hartree
zpe.thermalcorrgfe: 0.329610 hartree
zpe.sumelectzpe: -1142.904226 hartree
zpe.sumelectthermal: -1142.879293 hartree
zpe.sumelectthermalent: -1142.878349 hartree
zpe.sumelectthermalfe: -1142.959394 hartree
dipole: -1.1042 1.4091 4.7703
dipole: 5.0951
quadrupole: -112.5028 -153.5396 -144.9593
quadrupole: 17.3419 -9.6250 1.8810
quadrupole: 24.4978 -16.5390 -7.9587 17.3419 -9.6250 1.8810
hfenergy: -1143.2890036 hartree
pointgroup: C01[X(C20H22N4O2)]
dipole: -0.4665873 -1.560257 -1.1688578 debye
polarizability: 394.5231851|-4.0820187|211.0870372|-8.246527|7.2917817|197.4050673 unknown
InChI: InChI=1S/C20H22N4O2/c1-4-23(19(25)15-9-8-10-16(21)13-15)18-14(2)22(3)24(20(18)26)17-11-6-5-7-12-17/h5-13H,4,21H2,1-3H3
charge 0 multiplicity 1
48 atoms
O  1.451545 1.919052 -0.350403
O  -1.64322 -0.652137 1.911278
N  2.11435 -1.516936 0.351238
N  2.531427 -0.159892 0.167256
N  -1.106046 0.147735 -0.222535
N  -6.237122 -0.408143 -1.880523
C  0.24951 -0.246648 -0.042728
C  0.708548 -1.524138 0.249412
C  1.388722 0.676575 -0.094158
C  -1.37208 1.093478 -1.352259
C  3.891889 0.150595 -0.128727
C  -0.08432 -2.771986 0.479281
C  2.786378 -2.253845 1.453036
C  -2.024146 -0.132855 0.812847
C  -1.214944 0.428924 -2.732623
C  -3.485273 0.169425 0.59131
C  4.380687 1.450285 0.163746
C  4.744451 -0.815608 -0.72518
C  5.720999 1.769391 -0.13868
C  6.087995 -0.485514 -1.003202
C  -4.164279 -0.218738 -0.587522
C  -4.202559 0.758592 1.663544
C  6.584327 0.806124 -0.711757
C  -5.566318 -0.010912 -0.721065
C  -5.589079 0.982218 1.525529
C  -6.272703 0.607943 0.350976
H  -2.385465 1.50168 -1.224143
H  -0.651015 1.92658 -1.257526
H  0.491857 -3.680841 0.23569
H  -0.988539 -2.750696 -0.153508
H  -0.440474 -2.81894 1.525425
H  3.874465 -2.258008 1.289084
H  2.423968 -3.293063 1.446212
H  2.565895 -1.794709 2.435959
H  -1.931378 -0.401125 -2.87458
H  -1.388129 1.175997 -3.52853
H  -0.194174 0.028223 -2.863813
H  3.707086 2.191293 0.599293
H  4.343715 -1.797876 -0.996741
H  6.093077 2.775719 0.082848
H  6.741921 -1.234915 -1.463194
H  -3.614412 -0.707596 -1.400736
H  -3.672032 1.017031 2.584081
H  7.626231 1.060302 -0.93417
H  -6.147448 1.449337 2.344589
H  -7.352173 0.782099 0.261535
H  -5.738744 -0.84611 -2.64917
H  -7.240069 -0.277569 -1.970295
