program: Gaussian 09
title: 000298329
version: EM64L-G09RevD.01
frameworkgroup: C1[X(C9H6ClNO)]
method: RPBEPBE
basis: SDD
operation: Freq
keyword: #p
keyword: freq=noraman
keyword: PBEPBE/SDD
title: #p freq=noraman PBEPBE/SDD
converged: NO YES NO YES
title: Mulliken charges:
elementType: Cl O N C C C C C C C C C H H H H H H
charge: -0.037617 -0.251495 -0.424568 0.376997 0.277897 -0.133807 -0.340523 -0.370044 -0.273647 0.062967 -0.254815 -0.207033 0.333421 0.255633 0.236634 0.275761 0.237737 0.236502
chargesum: 0.00000
title: Mulliken charges with hydrogens summed into heavy atoms:
elementType: Cl O N C C C C C C C C C
charge: -0.037617 -0.251495 -0.091147 0.376997 0.277897 -0.133807 -0.084890 -0.133410 0.002114 0.062967 -0.017078 0.029469
polarizability: 1.72819082e+02 1.14054651e+01 1.39627604e+02 3.41452025e-03 8.81770035e-04 4.41761673e+01
1716.lowfreq: -7.6866 -6.2289 -0.0032 -0.0023 0.0017 8.1758 95.1098 138.0663 184.2870
frequency: 95.1053 138.0662 184.2868 202.5259 271.5935 292.1289 371.2713 413.2911 451.8246 484.5131 514.0240 549.5766 588.8677 635.1633 643.7723 732.1882 742.4837 752.6716 772.7733 816.0603 861.7301 868.0766 918.1882 936.9156 955.7196 988.1169 1036.5471 1127.8910 1165.8138 1182.0128 1242.1168 1265.8565 1277.3522 1342.8268 1385.6538 1411.6344 1456.2950 1484.4218 1552.6887 1590.3003 1620.4756 1645.3537 3129.2503 3147.6749 3160.0433 3177.1043 3197.3384 3513.7845
redmass: 5.3369 7.4332 4.4263 10.3305 4.8626 10.5896 9.5538 3.4809 9.6966 6.1380 3.4426 6.0648 4.4095 7.0687 1.8711 1.7451 5.6610 3.7397 1.3196 7.0066 1.5075 1.4637 6.3115 3.9163 1.3697 1.3245 2.1332 1.7437 1.6157 1.2204 2.0373 2.1054 2.0142 2.3759 2.6060 3.7344 3.1547 2.7124 8.0116 6.0897 6.9055 5.9921 1.0879 1.0892 1.0937 1.0999 1.0937 1.0768
irintensity: 1.3009 0.1723 1.0862 1.1417 5.2848 1.1553 10.8214 5.4347 7.7263 5.6481 7.8583 1.3656 3.1015 10.5005 19.5461 10.8763 14.7059 3.1709 158.1764 33.2821 37.5406 1.0357 25.2479 22.0713 4.6502 0.0021 7.1007 2.5547 8.6036 1.9009 38.0928 15.6614 3.6749 102.2361 3.7600 16.7030 8.0423 24.5749 6.1661 48.8252 27.3395 630.8253 4.2590 7.2947 9.8210 15.4330 2.5615 37.0981
temp: 298.150 k
press: 1.00000 atm
elementType: 17 8 7 6 6 6 6 6 6 6 6 6 1 1 1 1 1 1
symmnumber: 1
zpe: 336709.1 jmol-1
zpe.correction: 0.128246 hartree
zpe.thermalcorrener: 0.137431 hartree
zpe.thermalcorrenthalpy: 0.138375 hartree
zpe.thermalcorrgfe: 0.093349 hartree
zpe.sumelectzpe: -935.791094 hartree
zpe.sumelectthermal: -935.781909 hartree
zpe.sumelectthermalent: -935.780964 hartree
zpe.sumelectthermalfe: -935.825991 hartree
dipole: 4.7725 0.1504 -0.0002
dipole: 4.7749
quadrupole: -77.1475 -73.7742 -79.2800
quadrupole: -10.1793 0.0011 0.0004
quadrupole: -0.4136 2.9597 -2.5461 -10.1793 0.0011 0.0004
hfenergy: -935.91934 hartree
pointgroup: C01 [X(C9H6Cl1N1O1)]
dipole: -1.8536412 -0.3050704 0.0000742 debye
dipolederiv: -0.1394556 0.0126699 0.0000003 -0.0198056 -0.8537564 0.0000208 -0.0000137 0.0000438 -0.0548858 -1.3006167 0.316442 -0.0001305 0.6130462 -0.7177664 0.0000647 0.0002529 -0.0000961 -0.372172 -1.1270233 0.2224826 0.0000366 -0.1707136 -0.3002167 0.0000089 -0.0000772 0.0000032 -0.2873215 -0.4070637 -0.0458833 -0.0000289 -0.0831039 -0.4195789 0.0000087 0.0000129 0.0000153 0.0327738 0.6166988 -0.409383 0.0000122 -0.1639941 0.1884794 -0.0000182 0.0000371 -0.0000293 0.11259 0.7828374 -0.0430159 0.0000556 0.1656693 1.3621434 -0.0000494 -0.0000215 -0.0000698 -0.0438924 0.3092199 0.1317776 0.0000187 -0.0630745 0.0756103 0.000001 0.0000162 -0.0000069 -0.1235411 -0.2053954 0.1718503 0.0000067 -0.0462996 0.0822763 0.0000027 -0.0000227 0.000032 -0.1939499 -0.4091104 0.1779073 -0.0000296 0.4941541 -0.6333079 0.0000231 -0.0000132 0.0000841 -0.1168728 1.7296432 -0.2829496 0.0000992 -0.5762514 0.9935685 -0.0000584 -0.0001419 0.0000296 0.1952553 -0.1094651 -0.1471676 0.0000014 -0.3125261 -0.1907615 -0.0000121 0.0000031 -0.0000023 -0.1741125 0.0080182 -0.0433129 0.0000043 0.1903988 0.1989589 0.0000171 0.0000086 0.0000009 -0.1243556 0.1361481 -0.0295476 -0.0000206 -0.0298503 0.1772735 -0.000008 -0.0000101 -0.0000165 0.3207837 0.1148064 -0.0156831 -0.0000026 0.0309619 -0.0217263 -0.0000023 -0.0000043 0.0000026 0.1563819 0.0701928 0.0558881 -0.0000025 0.0052743 -0.0936399 -0.0000034 -0.0000089 0.0000033 0.1717306 0.0585143 -0.0424168 -0.0000024 -0.0108815 0.0677906 0.0000096 0.0000025 0.0000165 0.176404 -0.0790952 0.0651921 -0.0000085 0.0745665 0.0520446 0.0000017 -0.0000103 0.0000028 0.1679226 -0.0488537 -0.09485 -0.0000094 -0.0975706 0.0326083 -0.0000063 -0.0000093 -0.0000131 0.1572616 unknown
polarizability: 175.9058654|-4.2545878|136.5408211|0.0035206|-0.0002048|44.1761673 unknown
InChI: InChI=1S/C9H6ClNO/c10-7-5-9(12)11-8-4-2-1-3-6(7)8/h1-5,11H
charge 0 multiplicity 1
18 atoms
Cl 0.73475 3.118896 -0.000138
O  3.230621 -1.429114 -0.000126
N  0.894668 -1.466456 0.000002
C  -0.462308 0.566115 -0.000051
C  -0.365789 -0.867656 -0.00007
C  0.794148 1.294917 -0.000048
C  -1.750185 1.169836 -0.000103
C  -1.547658 -1.656997 -0.000151
C  2.021853 0.679667 0.000017
C  2.137636 -0.785009 0.000205
C  -2.912275 0.382627 -0.000161
C  -2.806896 -1.035074 -0.000185
H  0.965059 -2.489026 -0.000053
H  -1.817153 2.261919 -0.000106
H  -1.468717 -2.750589 -0.000172
H  2.958563 1.240694 -0.000028
H  -3.897859 0.858032 -0.000199
H  -3.712961 -1.650281 -0.000234
