program: Gaussian 09
title: 000298340
version: EM64L-G09RevD.01
frameworkgroup: C1[X(C8H15ClN2O5S)]
method: RPBEPBE
basis: SDD
operation: Freq
keyword: #p
keyword: freq=noraman
keyword: PBEPBE/SDD
title: #p freq=noraman PBEPBE/SDD
converged: YES YES NO NO
title: Mulliken charges:
elementType: Cl S O O O O O N N C C C C C C C C H H H H H H H H H H H H H H H
charge: -0.082037 0.960415 -0.564225 -0.565775 -0.440313 -0.216493 -0.310751 -0.455147 -0.392135 -0.372115 -0.627734 -0.133080 0.142476 -0.740751 0.311926 -0.330811 -0.554495 0.242309 0.305759 0.307549 0.271334 0.315482 0.338607 0.292551 0.262373 0.266675 0.301501 0.269638 0.244026 0.396316 0.268321 0.288603
chargesum: 0.00000
title: Mulliken charges with hydrogens summed into heavy atoms:
elementType: Cl S O O O O O N N C C C C C C C C
charge: -0.082037 0.960415 -0.564225 -0.565775 -0.043997 -0.216493 -0.310751 -0.116540 -0.090634 0.175953 -0.048852 0.182402 0.142476 0.080850 0.311926 0.182853 0.002429
polarizability: 1.74801365e+02 6.75392977e+00 1.40975369e+02 4.80409261e+00 -2.81187001e+00 1.42688453e+02
1716.lowfreq: -7.0456 -0.0023 -0.0015 0.0008 0.2375 6.9186 12.5890 19.2569 25.6988
frequency: 12.1717 19.2260 25.5985 32.7242 43.4942 61.9041 70.9825 78.6807 98.0241 114.0042 129.6345 143.5692 157.8377 206.7930 219.5231 230.5619 250.1441 285.4369 298.2413 314.7463 323.7440 366.1425 376.5008 413.5726 445.4444 477.8325 520.2746 540.5807 563.0340 574.6213 597.9718 600.7332 656.1043 693.7492 708.6464 732.4425 765.6091 793.1381 818.4555 864.9229 885.2184 912.0915 956.6023 963.3717 989.9111 997.4698 1016.9376 1042.5728 1059.0744 1080.6464 1108.6660 1144.2709 1166.4149 1195.5281 1205.9622 1218.5155 1236.3754 1252.9436 1276.5109 1290.2115 1300.6254 1301.7616 1326.9431 1352.3722 1369.2177 1408.0110 1419.2506 1425.8008 1441.1809 1446.5348 1456.6168 1469.9988 1508.2066 1622.8195 1669.3857 2979.5847 2996.8641 3010.2676 3028.8480 3033.3988 3055.5115 3067.5612 3077.9645 3124.4093 3155.6238 3177.7295 3180.2159 3524.4569 3539.9917 3552.8226
redmass: 9.2225 6.2535 6.3463 8.7545 5.8898 5.8730 7.3016 5.3005 3.5017 3.7167 5.0522 1.2378 4.6212 2.5586 4.8917 4.0295 5.7188 3.8070 3.5809 6.1471 5.1231 5.8265 3.7192 1.2975 3.9011 2.8868 3.3451 4.7708 1.9390 1.9653 3.6105 3.0428 1.8149 3.9391 5.6419 4.6544 1.6260 5.8858 2.6206 2.4798 3.0095 2.6186 1.4860 2.4179 2.4810 1.6413 2.0113 1.8835 3.0596 1.7213 3.2554 1.4818 1.3891 2.1038 1.3369 1.3331 1.3088 1.4224 1.3557 1.2426 1.2732 1.1644 1.8162 1.2991 1.3159 1.0597 1.1104 1.0549 1.1108 1.2092 1.4232 1.1029 2.4018 5.3468 9.2229 1.0805 1.0600 1.0605 1.0252 1.0555 1.0930 1.0657 1.1038 1.1090 1.1121 1.1066 1.1079 1.0644 1.0774 1.0777
irintensity: 1.2717 4.6934 1.4646 8.5940 2.3647 5.1804 2.8349 6.3278 10.2398 1.6390 9.1496 2.1959 0.1271 2.1936 2.4591 3.8884 7.2509 8.6061 24.9448 23.3596 2.2958 14.2146 26.4148 22.9588 20.1532 2.9139 68.6502 18.5579 100.2453 84.2973 3.2265 70.3596 164.1733 5.7475 46.0484 1.3048 12.5281 58.4871 13.7264 19.0069 37.0092 1.3275 51.8004 71.6891 3.4699 47.9297 21.3878 9.1723 57.7660 123.0877 34.9166 18.5582 14.4597 33.9955 7.5714 32.2602 53.8332 112.4369 18.0997 19.6731 51.4984 2.4271 47.8231 4.3056 4.4943 10.6489 4.9039 16.9954 13.9695 49.4223 62.8332 33.4546 647.9078 175.6997 188.0552 21.7157 48.9114 9.9759 1.6344 6.6650 6.1467 17.6867 6.7261 2.1284 13.8196 0.3922 1.9240 40.4529 27.7672 55.6858
temp: 298.150 k
press: 1.00000 atm
elementType: 17 16 8 8 8 8 8 7 7 6 6 6 6 6 6 6 6 1 1 1 1 1 1 1 1 1 1 1 1 1 1 1
symmnumber: 1
zpe: 631927.9 jmol-1
zpe.correction: 0.240689 hartree
zpe.thermalcorrener: 0.261457 hartree
zpe.thermalcorrenthalpy: 0.262401 hartree
zpe.thermalcorrgfe: 0.186018 hartree
zpe.sumelectzpe: -1656.110437 hartree
zpe.sumelectthermal: -1656.089669 hartree
zpe.sumelectthermalent: -1656.088725 hartree
zpe.sumelectthermalfe: -1656.165107 hartree
dipole: 0.6316 5.3118 -0.9817
dipole: 5.4385
quadrupole: -101.7626 -128.5008 -121.8332
quadrupole: 0.8352 -0.6112 -16.4000
quadrupole: 15.6030 -11.1353 -4.4677 0.8352 -0.6112 -16.4000
hfenergy: -1656.3511257 hartree
pointgroup: C01 [X(C8H15Cl1N2O5S1)]
dipole: -0.1201874 1.912827 0.9512719 debye
polarizability: 174.6270955|-8.5341827|140.0695492|0.3146752|2.589594|143.7685413 unknown
InChI: InChI=1S/C8H15ClN2O5S/c1-17(15,16)5-2-6(7(12)13)11-8(14)10-4-3-9/h6,10-12H,2-5H2,1H3
charge 0 multiplicity 1
32 atoms
Cl 5.05253 -2.187268 0.719377
S  -2.46413 -2.223013 0.133633
O  -1.62857 -2.506086 -1.245114
O  -2.567757 -3.347098 1.317026
O  -0.211882 2.336461 2.71066
O  -2.178946 2.8092 1.567742
O  1.501165 0.993461 -1.498279
N  0.894902 0.977924 0.755932
N  3.035539 0.239573 0.107862
C  -1.416265 0.443879 -0.111305
C  -1.726138 -0.611375 0.94421
C  -0.417445 1.527363 0.418866
C  -1.044018 2.291017 1.581226
C  -4.252537 -1.750932 -0.3715
C  1.802794 0.74951 -0.28589
C  4.064454 -0.090964 -0.879902
C  4.357477 -1.589626 -0.950298
H  -2.333804 0.961752 -0.442712
H  -0.936682 -0.026472 -0.989957
H  -0.821701 -1.012498 1.432905
H  -2.482839 -0.327662 1.693777
H  -0.291765 2.245315 -0.418531
H  1.193735 1.015761 1.731946
H  -4.660675 -2.667762 -0.819024
H  -4.78792 -1.468308 0.545509
H  -4.184909 -0.934767 -1.10365
H  3.199329 -0.059601 1.071408
H  3.678334 0.242627 -1.861848
H  4.998355 0.463422 -0.669092
H  -0.657427 2.847187 3.439191
H  5.140302 -1.825501 -1.686064
H  3.452792 -2.191122 -1.118107
