program: Gaussian 09
title: 000298396
version: EM64L-G09RevD.01
frameworkgroup: C1[X(C21H23NO3)]
method: RPBEPBE
basis: SDD
operation: Freq
keyword: #p
keyword: freq=noraman
keyword: PBEPBE/SDD
title: #p freq=noraman PBEPBE/SDD
converged: YES YES NO NO
title: Mulliken charges:
elementType: O O O N C C C C C C C C C C C C C C C C C C C C C H H H H H H H H H H H H H H H H H H H H H H H
charge: -0.308311 -0.217142 -0.473733 -0.094606 -0.127911 -0.042402 -0.446403 -0.441160 -0.508609 -0.370520 -0.458919 0.216090 -0.153824 0.395011 0.396348 -0.341961 -0.380600 -0.392577 -0.399549 -0.239407 -0.224075 -0.225020 -0.245596 -0.241579 -0.241758 0.259905 0.256352 0.247548 0.227538 0.226762 0.227178 0.222304 0.242304 0.179216 0.230211 0.219406 0.225475 0.371413 0.247105 0.275877 0.282756 0.269752 0.224744 0.226410 0.223878 0.226805 0.226327 0.228948
chargesum: 0.00000
title: Mulliken charges with hydrogens summed into heavy atoms:
elementType: O O O N C C C C C C C C C C C C C C C C C C C C C
charge: -0.308311 -0.217142 -0.102320 -0.094606 0.131994 0.213950 0.028682 0.012779 -0.044001 0.038907 -0.014037 0.216090 -0.153824 0.395011 0.396348 -0.094856 -0.104724 -0.109821 -0.129796 -0.014663 0.002335 -0.001141 -0.018791 -0.015253 -0.012810
polarizability: 2.43629163e+02 -9.57789438e+00 2.50652596e+02 -1.27399023e+01 8.16149317e+00 1.99058192e+02
1716.lowfreq: -20.2259 -12.3501 -5.4164 -1.7015 -0.0008 -0.0007 -0.0004 5.8356 12.3079
frequency: -17.5671 -9.2789 11.4862 27.5558 43.8369 52.2635 65.2563 76.4540 114.5918 142.7235 169.9186 208.0180 212.7599 232.4195 238.4656 263.8953 280.9585 285.2993 316.7864 335.7132 353.6839 382.2870 401.0979 405.3190 410.3819 469.2855 478.0431 511.3230 536.5042 545.5129 568.0093 593.5402 609.4989 615.6933 616.6186 646.2215 663.1303 695.4519 702.7317 709.3829 736.5954 754.0917 760.1926 781.7257 812.0828 852.3627 854.9441 862.2160 882.2685 885.7406 899.7823 908.5219 920.0612 927.4031 937.7012 940.9171 956.2040 980.1722 986.7962 989.4019 991.1468 995.7830 998.0809 999.6347 1012.3748 1017.6856 1029.5333 1031.0000 1049.1548 1071.7090 1081.4667 1092.8831 1096.5129 1112.7766 1127.4037 1135.1491 1148.6590 1151.1638 1169.9196 1171.6996 1175.6996 1176.1462 1181.1013 1191.2642 1195.3585 1210.5640 1240.0138 1265.6498 1281.6139 1287.1629 1297.0669 1309.1855 1309.8251 1314.5702 1319.2641 1330.4789 1332.8515 1350.2511 1352.7427 1378.9484 1382.6242 1431.9943 1435.3518 1465.3079 1467.2446 1476.8971 1477.7167 1479.6726 1480.7452 1495.0694 1589.8258 1593.2266 1606.4923 1610.3069 1635.5307 2868.8323 2980.3766 3008.0418 3010.1055 3012.1858 3013.8135 3032.3497 3039.7553 3068.0893 3077.0221 3086.1515 3090.9358 3123.5178 3124.0724 3133.4781 3136.3555 3146.2072 3153.1540 3158.9075 3168.2353 3170.6727 3182.0346 3535.9538
redmass: 3.4040 3.8177 3.6142 4.6672 3.9332 5.1357 4.6881 4.5396 4.7556 3.7754 4.3442 4.2337 4.3265 2.8460 4.1354 3.1374 4.6564 3.4226 2.7227 2.7005 3.2783 2.5251 2.8591 3.2322 2.5557 4.7893 3.7426 3.0246 3.8326 3.0806 5.7922 3.6071 3.1923 6.3963 6.4118 3.5833 5.8483 5.1347 2.1020 1.8709 3.0655 2.6833 1.7881 2.6631 2.7301 1.2692 2.0436 1.2443 2.2220 3.0646 3.2968 1.4677 2.2818 2.2969 1.8096 1.6550 2.4858 1.3956 1.5654 4.3460 5.1641 2.5714 1.3966 1.3921 3.6890 2.3333 2.1717 2.2145 1.7564 1.9274 1.5981 1.8641 3.4867 2.5162 2.7505 1.5055 2.6287 2.5786 1.2508 1.0951 1.6062 1.8352 1.5153 1.2586 1.1450 1.4069 1.3881 1.3277 1.2907 1.3305 1.2693 1.3992 1.2689 1.2713 1.3423 1.4020 1.3963 1.4233 1.3392 8.2116 9.1530 2.2014 2.2413 1.0910 1.0980 2.1399 1.0991 2.1876 1.0855 1.0907 6.1949 6.3347 6.0147 6.0917 11.6880 1.0714 1.0678 1.0634 1.0648 1.0677 1.0794 1.0870 1.0876 1.0975 1.1013 1.1036 1.1047 1.0849 1.0848 1.0885 1.0897 1.0935 1.0951 1.0970 1.0966 1.0981 1.0949 1.0648
irintensity: 0.2078 0.0772 0.7132 0.2432 0.9310 1.0848 0.9391 0.8996 1.0050 1.0060 0.7758 0.9542 0.2136 1.3293 4.2080 1.1096 1.9518 15.2977 92.8523 28.5904 5.3589 23.4995 1.4197 14.2053 50.0520 7.7600 4.3077 13.1963 6.5051 5.6860 5.9046 12.1771 8.8993 0.0229 0.3015 7.3599 25.9903 21.3599 34.1551 53.5179 33.1268 13.3930 39.7495 29.5359 14.3501 1.1778 10.3838 0.1832 1.2219 35.6687 11.8165 0.5195 24.3899 6.0879 2.9045 1.5829 25.1436 1.0728 0.6041 0.6851 0.2726 86.0533 6.4371 9.0165 38.9649 9.4622 13.7953 6.8030 6.7913 29.4097 4.2759 56.3829 31.7035 9.3124 175.4844 70.2414 111.3934 57.7455 5.2020 1.3093 7.9709 10.7689 2.1309 3.2215 0.7099 1.2447 13.5670 5.9474 1.7411 3.9485 6.5071 4.6915 0.4937 2.7621 0.7040 33.3695 15.4621 1.9887 20.8232 0.1176 0.6347 4.0816 29.6532 5.2490 13.2081 30.1377 6.4863 13.6872 8.1423 7.7813 1.6328 0.1238 9.3672 2.8380 88.0366 86.7231 68.5376 14.4245 23.5900 20.6024 11.8425 80.9757 15.1772 27.8420 18.8554 34.5183 44.5343 0.3953 0.2426 10.1917 17.9144 16.7950 37.7102 22.9707 11.3481 16.5560 6.7623 45.4464
temp: 298.150 k
press: 1.00000 atm
elementType: 8 8 8 7 6 6 6 6 6 6 6 6 6 6 6 6 6 6 6 6 6 6 6 6 6 1 1 1 1 1 1 1 1 1 1 1 1 1 1 1 1 1 1 1 1 1 1 1
symmnumber: 1
zpe: 1032096.4 jmol-1
zpe.correction: 0.393105 hartree
zpe.thermalcorrener: 0.413398 hartree
zpe.thermalcorrenthalpy: 0.414342 hartree
zpe.thermalcorrgfe: 0.342441 hartree
zpe.sumelectzpe: -1092.616676 hartree
zpe.sumelectthermal: -1092.596383 hartree
zpe.sumelectthermalent: -1092.595439 hartree
zpe.sumelectthermalfe: -1092.667340 hartree
dipole: -1.1889 -1.6095 1.1759
dipole: 2.3209
quadrupole: -142.1378 -134.8556 -145.3539
quadrupole: -0.7038 -8.9643 1.3266
quadrupole: -1.3554 5.9268 -4.5715 -0.7038 -8.9643 1.3266
hfenergy: -1093.0097813 hartree
pointgroup: C01 [X(C21H23N1O3)]
dipole: -0.5971212 0.566133 -0.3958631 debye
polarizability: 240.2624401|6.267486|251.3751774|10.92105|16.2927343|201.7023339 unknown
InChI: InChI=1S/C21H23NO3/c23-20(25-19-13-15-22-14-7-12-18(19)22)21(24,16-8-3-1-4-9-16)17-10-5-2-6-11-17/h1-6,8-11,18-19,24H,7,12-15H2
charge 0 multiplicity 1
48 atoms
O  -1.373757 0.731048 -0.23987
O  -0.245959 -0.042898 1.643389
O  0.590469 0.47427 -1.878573
N  -4.746688 -0.527262 0.42804
C  -3.282951 -0.664105 0.785606
C  -2.653877 0.760307 0.53418
C  -2.743468 -1.830165 -0.090171
C  -5.031167 0.918517 0.215003
C  -3.696307 1.533931 -0.29182
C  -5.041016 -1.440637 -0.715928
C  -4.028802 -2.587105 -0.51451
C  -0.234698 0.310156 0.445875
C  1.015186 0.409833 -0.477156
C  1.874385 -0.865272 -0.32309
C  1.812873 1.692541 -0.10766
C  2.615205 -1.098843 0.861126
C  2.561009 2.319377 -1.135832
C  1.904826 -1.824129 -1.363646
C  1.850059 2.231496 1.202304
C  3.374006 -2.280665 1.003001
C  3.332901 3.467622 -0.858511
C  2.671118 -3.003332 -1.221455
C  2.620856 3.384993 1.475503
C  3.406008 -3.238086 -0.037605
C  3.365389 4.007075 0.448895
H  -3.175242 -0.905775 1.857644
H  -2.428494 1.248893 1.499209
H  -2.027461 -2.463981 0.458066
H  -2.226583 -1.436493 -0.984529
H  -5.331243 1.390752 1.171215
H  -5.862388 1.050249 -0.498618
H  -3.551433 1.306088 -1.364429
H  -3.6297 2.626128 -0.154415
H  -4.871062 -0.955062 -1.709172
H  -6.090569 -1.783957 -0.680094
H  -3.88788 -3.192529 -1.42647
H  -4.372868 -3.252362 0.297877
H  -0.243225 1.012389 -1.912349
H  2.60211 -0.364026 1.671243
H  2.521982 1.899245 -2.145236
H  1.33658 -1.628576 -2.276217
H  1.281479 1.759736 2.011107
H  3.941829 -2.452226 1.924326
H  3.908825 3.9413 -1.661694
H  2.692794 -3.736789 -2.035619
H  2.638101 3.794785 2.491737
H  3.998744 -4.15327 0.073112
H  3.963002 4.900215 0.663212
