program: Gaussian 09
title: 000298321
version: EM64L-G09RevD.01
frameworkgroup: C1[X(C15H15NO)]
method: RPBEPBE
basis: SDD
operation: Freq
keyword: #p
keyword: freq=noraman
keyword: PBEPBE/SDD
title: #p freq=noraman PBEPBE/SDD
converged: YES YES NO NO
title: Mulliken charges:
elementType: O N C C C C C C C C C C C C C C C H H H H H H H H H H H H H H H
charge: -0.224835 -0.296781 -0.498660 -0.519701 0.432741 0.097585 0.295459 -0.440505 -0.380960 -0.343470 -0.344293 -0.221875 -0.223360 -0.244409 -0.241635 -0.224831 -0.220721 0.231703 0.213585 0.228496 0.255054 0.274932 0.233369 0.267655 0.245156 0.277687 0.223165 0.222063 0.225241 0.232390 0.234832 0.234922
chargesum: 0.00000
title: Mulliken charges with hydrogens summed into heavy atoms:
elementType: O N C C C C C C C C C C C C C C C
charge: -0.224835 -0.021849 -0.053371 -0.036151 0.432741 0.097585 0.295459 -0.207135 -0.113305 -0.098315 -0.066606 0.001290 -0.001296 -0.019168 -0.009245 0.010001 0.014201
polarizability: 2.51399585e+02 5.19103138e+00 1.60682313e+02 1.78311431e+01 -9.86906248e-01 8.94775549e+01
1716.lowfreq: -5.4241 -1.3802 -0.0009 -0.0007 0.0002 6.0129 22.8222 24.3274 27.7313
frequency: 22.7807 24.2810 27.6119 57.7111 77.6436 119.6581 147.4519 160.0041 215.5106 265.8186 295.9656 361.8729 393.2364 398.5359 406.4691 413.6141 461.2035 475.4429 558.6273 597.3022 613.0086 616.2767 655.3252 682.0026 697.1813 706.8653 745.6404 765.5964 780.1507 811.8725 858.0571 859.8721 913.5473 922.8396 949.6259 960.3404 973.1554 980.9576 989.6013 989.8908 991.9241 996.4068 1011.4551 1025.1626 1026.3062 1075.0257 1080.8333 1085.1885 1160.8416 1169.0651 1173.8297 1180.0226 1189.2124 1199.8703 1213.3796 1228.8292 1268.2343 1306.9551 1313.4942 1324.2184 1354.7672 1386.8795 1387.9460 1424.6619 1435.9231 1439.6830 1468.8879 1475.6648 1479.5105 1486.2198 1571.0538 1593.9653 1598.5856 1612.2895 1614.6216 2921.2228 2959.6562 2974.1953 3023.4143 3114.1571 3122.2879 3129.2724 3136.3535 3138.4598 3149.4159 3150.3701 3158.6780 3161.8454 3169.4518 3452.0269
redmass: 4.6131 5.5976 3.7834 3.7570 4.3777 4.6949 5.1177 4.0016 2.6616 2.8161 5.6570 3.2057 5.3423 2.8501 2.8773 3.1448 5.8575 2.9838 2.3856 5.2525 6.4191 6.2587 2.9197 2.0816 1.8024 1.9067 1.6165 1.8084 4.3867 3.5823 1.2485 1.2498 1.3957 1.8067 2.6013 2.1773 2.3260 1.3920 6.1402 6.0659 1.3878 1.3425 1.3448 2.1335 2.0576 1.9411 1.7582 1.5841 2.6879 1.0627 1.0694 1.1168 1.1341 1.3448 2.6308 2.6159 1.2836 1.4443 1.3165 1.3490 1.5580 8.7045 4.6277 1.1279 2.2445 2.0779 1.2280 1.4509 2.1229 1.5168 6.9105 6.1442 6.7812 6.6183 6.1155 1.0620 1.0621 1.0965 1.0974 1.0861 1.0870 1.0851 1.0923 1.0879 1.0924 1.0952 1.0962 1.1009 1.1015 1.0739
irintensity: 0.5511 0.4874 0.1853 0.8344 2.6875 3.8518 0.4614 0.0328 8.3519 7.5930 19.3247 2.6095 3.7512 0.3572 0.0893 0.7574 7.9424 15.8744 13.1874 4.8615 0.4983 0.8344 11.8691 119.2761 49.6721 51.0668 77.6278 45.5651 27.6745 7.4257 0.2028 0.3203 9.7066 4.6388 21.3665 39.6887 6.8790 0.4454 2.9146 0.0577 0.4297 1.4119 0.8372 10.2421 2.9239 20.1850 15.5387 8.2678 84.8225 0.6750 1.8326 0.4248 17.1359 29.6959 18.6122 106.8689 3.7531 6.2492 2.3127 15.1698 4.5916 3.4325 1.3885 16.4375 23.8846 9.7011 22.7611 26.5476 0.4983 4.2360 92.4483 2.4971 44.4233 7.9339 8.0411 44.8625 59.9183 23.1780 14.0489 7.4057 1.2145 0.3466 29.7768 5.4470 16.1250 30.4097 22.1340 23.9563 22.6095 2.1727
temp: 298.150 k
press: 1.00000 atm
elementType: 8 7 6 6 6 6 6 6 6 6 6 6 6 6 6 6 6 1 1 1 1 1 1 1 1 1 1 1 1 1 1 1
symmnumber: 1
zpe: 682255.8 jmol-1
zpe.correction: 0.259858 hartree
zpe.thermalcorrener: 0.274889 hartree
zpe.thermalcorrenthalpy: 0.275833 hartree
zpe.thermalcorrgfe: 0.214546 hartree
zpe.sumelectzpe: -709.348263 hartree
zpe.sumelectthermal: -709.333231 hartree
zpe.sumelectthermalent: -709.332287 hartree
zpe.sumelectthermalfe: -709.393575 hartree
dipole: -3.0894 -1.4874 -1.0328
dipole: 3.5810
quadrupole: -80.3628 -95.0460 -103.7290
quadrupole: 3.5746 3.5021 -2.0753
quadrupole: 12.6831 -2.0001 -10.6831 3.5746 3.5021 -2.0753
hfenergy: -709.6081206 hartree
pointgroup: C01 [X(C15H15N1O1)]
dipole: 1.1883151 -0.7564995 -0.0238507 debye
polarizability: 249.7071|-20.0237885|133.9043606|14.088134|34.0876297|117.9479919 unknown
InChI: InChI=1S/C15H15NO/c17-15(14-9-5-2-6-10-14)12-16-11-13-7-3-1-4-8-13/h1-10,16H,11-12H2
charge 0 multiplicity 1
32 atoms
O  1.069141 1.492858 0.149564
N  -0.869767 -0.269077 -0.887303
C  -1.576846 -0.301845 0.416273
C  0.536737 -0.669595 -0.850113
C  -3.080561 -0.106338 0.248868
C  1.501095 0.351991 -0.189808
C  2.942686 -0.021664 0.006962
C  -3.815587 0.64148 1.202066
C  -3.77128 -0.691826 -0.842841
C  3.465422 -1.280691 -0.398386
C  3.81162 0.92485 0.61695
C  -5.216406 0.79075 1.078209
C  -5.169684 -0.540397 -0.971543
C  -5.898645 0.198726 -0.009509
C  4.828901 -1.584128 -0.196131
C  5.171357 0.619935 0.82071
C  5.683629 -0.636481 0.413988
H  -1.187295 0.448699 1.140224
H  -1.385967 -1.302313 0.85924
H  0.617008 -1.641471 -0.324168
H  0.898981 -0.846352 -1.884595
H  -0.991714 0.644238 -1.345596
H  -3.288808 1.112359 2.041738
H  -3.192141 -1.250577 -1.585871
H  2.818397 -2.025693 -0.873196
H  3.390469 1.889587 0.919524
H  -5.771488 1.372737 1.822958
H  -5.692283 -0.997465 -1.82006
H  -6.983769 0.316421 -0.109687
H  5.225872 -2.555023 -0.51191
H  5.833341 1.354018 1.292812
H  6.741585 -0.874813 0.571131
