program: Gaussian 09
title: 000298422
version: EM64L-G09RevD.01
frameworkgroup: C1[X(C28H27NO3)]
method: RPBEPBE
basis: SDD
operation: Freq
keyword: #p
keyword: freq=noraman
keyword: PBEPBE/SDD
title: #p freq=noraman PBEPBE/SDD
converged: NO YES NO NO
title: Mulliken charges:
elementType: O O O N C C C C C C C C C C C C C C C C C C C C C C C C C C C C H H H H H H H H H H H H H H H H H H H H H H H H H H H
charge: -0.213169 -0.257471 -0.255967 -0.199218 -0.262011 -0.457750 -0.453530 -0.446666 -0.473172 0.018527 0.338681 -0.474585 0.527879 -0.511155 -0.472757 0.242183 -0.352428 0.204876 -0.475393 -0.390497 0.414716 0.379825 -0.389549 -0.335118 -0.383406 -0.408391 -0.219504 -0.227651 -0.228887 -0.217659 -0.244601 -0.240191 0.254401 0.214944 0.239727 0.239710 0.216010 0.209795 0.260095 0.254362 0.217820 0.274222 0.326058 0.238001 0.254536 0.215507 0.244317 0.226748 0.224375 0.217941 0.260368 0.224846 0.287504 0.224380 0.228524 0.226129 0.226232 0.229230 0.228258
chargesum: 0.00000
title: Mulliken charges with hydrogens summed into heavy atoms:
elementType: O O O N C C C C C C C C C C C C C C C C C C C C C C C C C C C C
charge: -0.213169 -0.257471 -0.255967 -0.199218 -0.007611 -0.003079 0.002190 0.023224 -0.000991 0.018527 0.338681 -0.200363 0.527879 -0.185097 -0.234756 0.242183 -0.097892 0.204876 -0.015570 0.060626 0.414716 0.379825 -0.171608 -0.074749 -0.158560 -0.120886 0.004876 0.000872 -0.002758 0.008573 -0.015372 -0.011933
polarizability: 5.25604962e+02 4.14620300e+00 2.85804889e+02 -8.35450558e+00 2.46419755e+01 2.21446640e+02
1716.lowfreq: -7.3058 -4.5834 -0.0007 -0.0002 0.0011 1.3519 8.8688 13.6854 17.6328
frequency: 8.1976 13.5418 17.5246 19.5776 27.7558 37.0475 41.6413 49.3529 71.4971 73.9756 103.7059 129.7919 133.2668 142.3629 155.6827 160.0171 180.0993 199.3042 213.3634 231.6766 264.4197 273.4744 289.7944 330.6174 341.9898 367.8586 395.4991 400.9996 401.4306 421.5831 462.7307 464.7468 468.2483 471.4378 504.3697 508.7052 517.7335 546.5771 551.5881 563.7165 586.8374 612.6774 615.8404 616.8875 636.2283 639.7494 696.4739 702.4857 703.1662 716.9494 740.4577 744.3718 746.8797 776.2311 779.4699 797.5061 800.6088 803.1388 807.5496 819.4478 844.0539 853.6424 858.2435 867.2195 875.8856 894.8050 911.2851 913.1288 921.7924 929.8472 941.2926 970.1671 974.5459 977.6802 978.3378 981.5897 983.3610 989.2883 989.5641 993.2079 997.8437 998.0754 1017.9596 1020.3159 1026.7850 1028.3277 1032.1808 1050.1329 1069.8417 1084.2276 1085.6897 1091.7255 1129.1574 1159.1800 1170.2936 1172.4176 1172.6057 1183.4883 1185.3410 1187.3079 1201.9806 1203.9398 1206.2672 1213.8098 1218.2385 1239.1330 1240.1328 1241.0696 1271.1494 1273.1264 1283.5726 1297.5914 1304.7137 1312.0090 1314.8708 1320.3358 1327.3421 1329.1082 1345.4698 1351.4735 1358.3675 1386.7431 1389.7809 1398.8492 1433.6808 1439.7742 1441.2072 1459.3015 1463.9734 1468.4428 1470.6913 1474.0676 1482.8625 1484.3436 1486.4364 1498.4630 1563.2428 1570.7333 1595.2770 1595.8721 1605.4561 1615.5946 1619.5698 1648.2918 2937.8800 2987.7317 2987.9801 2989.2806 2992.8258 3004.6523 3006.9337 3049.0060 3050.9157 3058.5162 3069.1341 3076.2611 3082.2728 3087.2028 3110.3165 3112.7160 3126.6487 3127.2824 3134.6733 3137.3370 3141.4153 3142.5398 3149.1079 3159.3001 3163.9775 3167.0404 3175.0788
redmass: 4.4611 5.0848 4.0919 4.2325 5.5838 5.1753 4.8173 3.8587 4.6769 4.6079 4.0586 3.6743 4.9527 6.0443 3.3426 3.2605 5.0217 4.9802 3.1059 5.3304 2.4555 4.5054 3.5382 3.5273 3.1912 2.7600 4.9468 2.8321 2.8512 4.4974 3.3255 3.2013 5.1066 3.4219 4.9892 5.2894 5.8750 4.9544 6.1075 5.5142 6.0587 5.1918 6.4641 6.3327 3.9771 5.4672 4.7877 2.2442 2.3050 4.3985 1.3999 2.4512 2.2739 4.1320 5.5884 1.2400 3.6427 1.5146 1.5672 4.3152 2.7421 1.2637 1.2509 4.8139 3.0135 3.1683 1.3941 1.3162 1.3854 1.6547 2.9462 1.8293 1.8437 1.6173 2.1478 1.3955 6.5832 6.1668 5.7666 2.0841 1.5598 1.3598 2.2774 1.6751 2.1779 2.1584 2.9022 2.7624 2.2135 1.5876 1.5509 1.6535 2.7450 2.0835 1.6518 1.0529 1.0986 1.3145 1.1352 1.1152 1.3974 2.2281 1.1333 2.0395 1.6985 1.4614 1.1994 1.6620 1.6894 1.5797 1.4916 1.6616 1.2620 1.4250 1.3556 1.2936 1.7393 1.3127 1.4032 1.6294 2.0410 5.8390 4.9900 3.5350 3.8643 2.1565 2.2987 1.0761 1.1661 1.0837 1.0821 1.2411 1.1073 1.8881 2.3193 2.5745 7.8555 7.9847 6.1804 6.1978 6.6705 6.0369 5.9936 8.4885 1.0553 1.0611 1.0619 1.0609 1.1050 1.0624 1.0633 1.1024 1.1026 1.1008 1.0881 1.1044 1.1047 1.0876 1.0879 1.0871 1.0865 1.0867 1.0891 1.0917 1.0930 1.0926 1.0958 1.0984 1.1014 1.0945 1.0968
irintensity: 0.0604 0.0729 0.1905 0.3238 0.0807 1.0233 1.5780 0.0703 0.3179 0.4429 5.4039 2.0005 1.2375 3.2155 0.7204 2.2190 0.8066 0.6100 2.2459 3.4934 0.5419 0.2800 0.6753 2.4218 6.9673 3.9528 1.2218 0.2581 0.2302 2.0997 2.3736 15.0917 21.2308 3.8701 0.5468 4.4152 2.4102 12.5284 19.8795 0.0604 43.2700 8.6776 1.1404 3.4430 15.8428 5.1872 26.0239 28.2595 29.0290 9.2513 74.5798 30.7343 34.5150 1.9128 20.8676 12.6462 5.5377 33.4033 28.5799 9.2608 31.9549 3.1860 0.1069 3.5768 1.0706 1.3871 7.8074 1.8623 1.5924 14.0061 16.4162 22.1023 11.5762 8.8098 25.9859 2.3149 144.3595 0.3488 1.0804 12.2374 16.4985 0.2152 29.9923 2.2639 4.7566 11.2912 15.0012 9.2099 0.1773 13.4776 4.2037 162.9100 325.9907 61.0713 35.2415 0.2155 3.8524 0.5257 1.3406 8.1151 2.6013 16.2764 0.9439 15.6677 4.6011 134.4022 13.5495 220.1592 232.8925 79.8432 30.9227 19.8302 1.0512 22.6803 4.6025 0.6070 14.1647 2.9536 4.6718 19.4954 1.5405 5.2834 13.8038 7.6295 59.6025 13.8387 23.7923 1.7403 146.7367 12.3913 11.2627 19.9653 33.9908 9.6723 3.6501 334.1655 105.0121 461.0671 0.5983 1.0354 82.4466 1.2346 7.9566 65.8471 35.9557 73.6367 35.4500 5.7761 25.9766 60.6745 82.1576 4.0132 6.7351 14.1454 49.9212 31.7591 45.2291 2.1917 10.6297 9.6359 0.8099 1.1232 11.2531 17.1367 30.3363 30.2832 26.7689 36.3456 20.2784 23.2707 8.2949
temp: 298.150 k
press: 1.00000 atm
elementType: 8 8 8 7 6 6 6 6 6 6 6 6 6 6 6 6 6 6 6 6 6 6 6 6 6 6 6 6 6 6 6 6 1 1 1 1 1 1 1 1 1 1 1 1 1 1 1 1 1 1 1 1 1 1 1 1 1 1 1
symmnumber: 1
zpe: 1256593.8 jmol-1
zpe.correction: 0.478611 hartree
zpe.thermalcorrener: 0.506251 hartree
zpe.thermalcorrenthalpy: 0.507195 hartree
zpe.thermalcorrgfe: 0.414575 hartree
zpe.sumelectzpe: -1361.275710 hartree
zpe.sumelectthermal: -1361.248071 hartree
zpe.sumelectthermalent: -1361.247126 hartree
zpe.sumelectthermalfe: -1361.339746 hartree
dipole: 1.1535 2.6571 1.1366
dipole: 3.1117
quadrupole: -173.1628 -187.1733 -182.7680
quadrupole: -27.4863 -16.5961 -0.1898
quadrupole: 7.8719 -6.1386 -1.7333 -27.4863 -16.5961 -0.1898
hfenergy: -1361.7543212 hartree
pointgroup: C01 [X(C28H27N1O3)]
dipole: -0.7874927 -0.9206832 0.1759128 debye
polarizability: 491.7978021|-70.2775534|319.1379942|-49.5162838|17.713421|221.9206951 unknown
InChI: InChI=1S/C28H27NO3/c30-28-24-13-15-29(16-14-24)25(28)17-23-11-12-26(31-19-21-7-3-1-4-8-21)27(18-23)32-20-22-9-5-2-6-10-22/h1-12,17-18,24H,13-16,19-20H2
charge 0 multiplicity 1
59 atoms
O  5.864115 1.558157 -1.295821
O  -1.438791 -0.578061 0.702783
O  -2.546472 1.801686 0.633273
N  3.481541 -1.086187 -0.342719
C  6.014989 -0.887526 -0.929028
C  5.309848 -1.853615 -1.930961
C  5.846058 -1.456575 0.513363
C  3.79086 -1.947185 -1.539787
C  4.308316 -1.560824 0.823971
C  5.294607 0.465652 -0.992392
C  3.850766 0.304595 -0.648285
C  2.997531 1.382617 -0.621211
C  1.576545 1.469388 -0.304673
C  0.777531 0.32775 0.019827
C  0.960313 2.75066 -0.313031
C  -0.581586 0.468859 0.333279
C  -0.406061 2.900425 -0.005432
C  -1.189857 1.769213 0.319665
C  -0.917922 -1.959274 0.637865
C  -3.21377 3.108888 0.67593
C  -0.831931 -2.498475 -0.782685
C  -4.66109 2.896617 1.086145
C  0.236353 -3.34426 -1.165577
C  -1.850131 -2.199343 -1.7229
C  -5.56221 3.988095 1.006693
C  -5.122349 1.646843 1.563041
C  0.282691 -3.898256 -2.465615
C  -1.799888 -2.743795 -3.024386
C  -6.907783 3.835229 1.405931
C  -6.471519 1.495038 1.958819
C  -0.736326 -3.599606 -3.398481
C  -7.367373 2.585666 1.884499
H  7.078433 -0.749951 -1.184571
H  5.798603 -2.845384 -1.878257
H  5.430716 -1.481307 -2.963988
H  6.354056 -0.79986 1.241961
H  6.332992 -2.449018 0.567307
H  3.507436 -2.984383 -1.282581
H  3.13884 -1.620536 -2.366883
H  4.035253 -0.949912 1.700881
H  4.013087 -2.604917 1.036135
H  3.490829 2.33365 -0.875725
H  1.280536 -0.643306 0.003247
H  1.558295 3.634405 -0.563286
H  -0.854219 3.897664 -0.022428
H  0.057795 -2.03305 1.157366
H  -1.666056 -2.520579 1.225201
H  -2.69097 3.761723 1.4075
H  -3.156226 3.591937 -0.321981
H  1.037904 -3.564219 -0.448767
H  -2.665755 -1.528652 -1.43035
H  -5.215443 4.96012 0.631785
H  -4.422641 0.807908 1.611231
H  1.113794 -4.553077 -2.751694
H  -2.588298 -2.502945 -3.746337
H  -7.595695 4.685671 1.340495
H  -6.821861 0.523328 2.325107
H  -0.70001 -4.023673 -4.40825
H  -8.411896 2.464766 2.192781
