program: Gaussian 09
title: 000298315
version: EM64L-G09RevD.01
frameworkgroup: C1[X(C8H17NO6)]
method: RPBEPBE
basis: SDD
operation: Freq
keyword: #p
keyword: freq=noraman
keyword: PBEPBE/SDD
title: #p freq=noraman PBEPBE/SDD
converged: YES YES NO NO
title: Mulliken charges:
elementType: O O O O O O N C C C C C C C C H H H H H H H H H H H H H H H H H
charge: -0.448812 -0.447735 -0.460978 -0.475833 -0.441288 -0.270424 -0.352323 -0.161908 -0.138253 -0.181522 -0.122190 -0.402648 -0.325354 0.248765 -0.769440 0.268085 0.199441 0.271663 0.231999 0.291774 0.214807 0.232880 0.181861 0.356669 0.381938 0.310551 0.344220 0.385000 0.356885 0.254990 0.255922 0.211263
chargesum: 0.00000
title: Mulliken charges with hydrogens summed into heavy atoms:
elementType: O O O O O O N C C C C C C C C
charge: -0.092143 -0.065797 -0.116758 -0.090833 -0.084403 -0.270424 -0.041772 0.106177 0.061188 0.090140 0.109809 0.103932 0.089387 0.248765 -0.047266
polarizability: 1.48666282e+02 1.08716388e+00 1.10160683e+02 -5.67465874e+00 -1.68293384e+00 9.08394412e+01
1716.lowfreq: -20.7678 -9.6365 0.0008 0.0010 0.0013 5.9525 20.6433 38.0784 41.8807
frequency: 20.1969 37.7494 41.8737 62.8020 77.5380 79.0699 97.8056 106.2433 129.8443 189.4790 195.1969 226.3231 243.2546 269.3487 273.7425 290.5325 361.1371 378.1204 389.4520 434.8237 444.4022 464.7167 495.9726 503.6593 528.1029 571.4031 599.2772 607.7906 617.3872 632.2405 661.8871 725.3261 805.1458 840.0444 858.8719 897.5993 950.5162 975.4733 983.4988 1003.9439 1015.6537 1039.4099 1041.5143 1052.9624 1069.6274 1084.6397 1106.6300 1126.4818 1156.7625 1168.6916 1190.1231 1210.0044 1241.3569 1246.1882 1266.9322 1272.4613 1299.0739 1313.6723 1325.6294 1336.6501 1362.8329 1366.9796 1372.3129 1373.3662 1380.0741 1387.6468 1394.9093 1450.1016 1461.6240 1465.5644 1470.9119 1482.2052 1621.1353 2939.1354 2942.1381 2955.8119 2995.2317 2996.9939 3041.1105 3059.0788 3067.5135 3094.3712 3097.3274 3102.6012 3471.3796 3496.9861 3522.7542 3535.9445 3539.0706 3548.2713
redmass: 5.8948 5.3070 5.0505 2.1811 1.8015 3.3348 5.6638 3.2833 3.6411 4.4027 6.8373 4.6415 4.4641 4.8743 4.2909 3.8970 2.9982 1.7604 1.6237 2.8815 1.3350 3.5405 1.5864 1.7721 3.0697 2.5993 3.1715 3.0932 1.1262 1.2629 1.2089 3.6884 3.4691 3.1187 2.6175 3.9301 5.2876 1.9388 3.1064 1.8573 2.7844 2.3698 1.6607 3.1956 2.5954 3.7151 2.8208 2.4690 1.2656 1.1859 1.2374 1.1635 1.6208 1.5155 1.1861 1.4243 1.2849 1.2305 1.2213 1.3664 1.3672 1.4131 1.2603 1.1934 1.2489 1.2307 1.6026 1.0468 1.0839 1.1545 1.0764 1.8582 6.7182 1.0697 1.0703 1.0827 1.0844 1.0361 1.0855 1.0864 1.0910 1.0939 1.0992 1.0995 1.0656 1.0652 1.0649 1.0657 1.0661 1.0776
irintensity: 3.0734 4.5544 2.2203 2.9195 0.7154 8.6489 8.8732 0.3261 11.0131 10.1907 3.1712 11.8802 7.8829 5.4618 5.4383 6.7542 6.6351 65.8782 33.7737 11.5324 136.4163 1.9206 90.2417 84.6219 18.7036 20.0664 79.2868 59.8287 256.8665 96.4613 152.6045 51.3146 6.4431 44.5935 19.8727 40.5070 62.3114 30.2301 70.6318 21.8993 38.4161 97.2819 17.8736 42.0966 10.1072 13.3876 3.2883 10.3189 58.8181 13.6400 31.0492 39.5350 14.4712 10.9017 80.9526 101.5154 22.5410 15.8633 1.5184 0.8227 7.4402 18.2957 23.4622 56.5180 18.9143 60.5489 21.5647 16.1698 2.6880 96.0229 13.8721 177.9771 190.5194 51.1623 42.2387 43.1300 49.1667 10.9523 8.0377 14.1365 17.5087 18.6601 14.9475 14.4544 62.1353 34.8997 11.9838 15.3722 5.0595 25.4614
temp: 298.150 k
press: 1.00000 atm
elementType: 8 8 8 8 8 8 7 6 6 6 6 6 6 6 6 1 1 1 1 1 1 1 1 1 1 1 1 1 1 1 1 1
symmnumber: 1
zpe: 685649.5 jmol-1
zpe.correction: 0.261150 hartree
zpe.thermalcorrener: 0.278981 hartree
zpe.thermalcorrenthalpy: 0.279926 hartree
zpe.thermalcorrgfe: 0.213626 hartree
zpe.sumelectzpe: -819.890939 hartree
zpe.sumelectthermal: -819.873107 hartree
zpe.sumelectthermalent: -819.872163 hartree
zpe.sumelectthermalfe: -819.938463 hartree
dipole: -3.4870 3.8967 -2.1176
dipole: 5.6416
quadrupole: -119.7604 -95.5054 -85.4672
quadrupole: -17.0660 -1.5271 -4.8165
quadrupole: -19.5161 4.7389 14.7772 -17.0660 -1.5271 -4.8165
hfenergy: -820.1520886 hartree
pointgroup: C01 [X(C8H17N1O6)]
dipole: -1.3846479 0.845342 1.5148214 debye
polarizability: 148.8731415|3.8352248|90.4900302|2.1954857|1.3703838|110.3032355 unknown
InChI: InChI=1S/C8H17NO6/c1-4(11)9-2-5(12)7(14)8(15)6(13)3-10/h5-10,12-15H,2-3H2,1H3
charge 0 multiplicity 1
32 atoms
O  0.695892 -0.563614 -1.51482
O  1.598571 -1.142359 1.459285
O  -0.651554 0.611805 1.799297
O  3.260999 0.534133 -1.388634
O  5.624365 -0.208893 -0.117248
O  -4.205422 0.019905 -1.746227
N  -3.138826 0.529732 0.256976
C  0.6674 0.321162 -0.326595
C  1.858412 0.042711 0.627243
C  -0.700766 0.147504 0.380824
C  3.1641 -0.257739 -0.148042
C  -1.849635 0.833645 -0.368282
C  4.422336 0.101109 0.651924
C  -4.245258 0.129697 -0.483647
C  -5.505282 -0.163068 0.325387
H  0.771311 1.333285 -0.757211
H  1.996288 0.94183 1.266861
H  -0.920453 -0.928775 0.487898
H  3.178954 -1.342241 -0.381796
H  -1.895629 0.479481 -1.41374
H  -1.669481 1.931424 -0.395575
H  4.473015 -0.500606 1.573132
H  4.386322 1.181707 0.915535
H  0.697702 -1.505124 -1.199242
H  0.916957 -0.872872 2.133037
H  -3.194424 0.590932 1.275508
H  -0.483473 1.58976 1.816157
H  2.561696 0.186227 -2.007276
H  5.481661 0.181484 -1.020174
H  -6.305454 0.528253 0.008532
H  -5.849634 -1.18561 0.095286
H  -5.363592 -0.068283 1.415926
