program: Gaussian 09
title: 000298301
version: EM64L-G09RevD.01
frameworkgroup: C1[X(C9H16O8)]
method: RPBEPBE
basis: SDD
operation: Freq
keyword: #pfreq=noraman
keyword: PBEPBE/SDD
title: #p freq=noraman PBEPBE/SDD
converged: YES YES NO NO
title: Mulliken charges:
elementType: O O O O O O O O C C C C C C C C C H H H H H H H H H H H H H H H H
charge: -0.272369 -0.279815 -0.443505 -0.449335 -0.495923 -0.446339 -0.379475 -0.274484 -0.070311 -0.157625 0.375339 -0.149292 -0.203987 -0.119275 -0.694658 -0.686870 0.223798 0.258172 0.291914 0.251081 0.251302 0.231933 0.226761 0.213628 0.246418 0.233352 0.223686 0.222820 0.369440 0.366815 0.386372 0.365324 0.385108
chargesum: 0.00000
title: Mulliken charges with hydrogens summed into heavy atoms:
elementType: O O O O O O O O C C C C C C C C C
charge: -0.272369 -0.279815 -0.074065 -0.082519 -0.109551 -0.081015 0.005633 -0.274484 0.187861 0.134288 0.375339 0.101788 0.047315 0.112658 -0.007851 -0.007012 0.223798
polarizability: 1.56222393e+02 8.63440248e+00 1.08114008e+02 1.29547623e+00 -4.04395464e+00 1.07760415e+02
1716.lowfreq: -5.4242 -0.0007 -0.0004 0.0003 6.7256 9.0308 27.4341 37.4512 44.5727
frequency: 27.3798 37.2380 44.5581 58.2623 72.4327 88.9756 114.6999 169.0414 170.4711 183.4692 223.1673 244.3949 249.1139 273.7802 284.8040 290.8030 313.5610 318.2495 331.6107 344.6839 377.9918 413.9696 453.0739 462.6086 505.7385 519.3688 571.7969 621.0649 625.5809 648.4315 684.3457 701.6992 722.0230 759.7175 769.0342 776.2087 789.8376 825.8967 851.0378 891.7815 916.7095 922.5030 936.1080 965.1376 976.6777 983.8924 989.4749 1021.3537 1034.4733 1061.4301 1089.8719 1115.1642 1143.8994 1164.5031 1199.8195 1213.4289 1231.9147 1245.8111 1247.8226 1272.7424 1284.7747 1292.6232 1313.2350 1330.8691 1343.2941 1358.9473 1369.1996 1378.3656 1379.0693 1390.6664 1400.7351 1450.2538 1452.3839 1453.7520 1467.6410 1473.4308 1623.9749 2989.5797 2991.6693 2998.3790 3002.8661 3011.9405 3036.7994 3099.2673 3105.3055 3108.0408 3109.5930 3116.6553 3200.0814 3357.5275 3438.4613 3494.4952 3568.4747
redmass: 3.8511 6.0281 6.5232 6.4445 7.8592 5.5635 5.5834 4.7170 1.0862 4.9795 1.0949 5.3176 5.7570 2.3700 3.8988 4.5502 4.0456 1.6335 3.0019 7.1238 4.2404 3.3658 3.4618 1.3028 4.4541 3.3865 3.8966 1.5506 3.4072 1.1727 2.8689 5.0325 3.4389 3.7320 1.9607 3.8329 4.7314 4.8547 3.3331 4.0160 3.8395 1.4889 2.5991 5.3848 3.7165 1.4354 3.7615 3.6399 2.7772 3.6578 2.5656 1.9724 1.8436 1.2052 1.4295 2.3003 1.2994 2.3589 1.5063 1.1654 1.3315 1.2979 1.2501 1.2405 1.5073 1.4424 1.3754 1.2916 1.3028 1.2244 1.6080 1.0507 1.0484 1.4666 1.0643 1.0474 7.3931 1.0835 1.0841 1.0356 1.0356 1.0850 1.0878 1.1001 1.1003 1.0999 1.0869 1.1010 1.0679 1.0664 1.0636 1.0638 1.0658
irintensity: 1.8406 1.1175 1.2529 1.2066 1.5243 3.2894 0.8096 15.7278 0.0567 3.1466 1.0469 0.9775 7.6886 31.2871 18.8425 13.4172 4.0601 106.9914 0.9402 9.1132 9.6892 16.9253 8.4797 86.5197 58.0422 127.6749 27.3368 112.5863 23.3275 50.8395 32.1880 11.9069 98.7389 14.1135 78.3502 24.8014 40.1549 52.2914 42.8078 62.4015 62.0474 3.0663 5.5793 146.1754 73.7480 9.9743 50.1076 68.6482 113.1035 123.8318 252.2215 4.0373 54.6506 30.0984 42.5493 148.7715 19.7583 67.5930 0.5612 23.6938 23.6421 19.4284 9.6627 0.9079 99.5257 9.0177 30.3636 55.2717 22.0377 25.1633 68.7079 4.4241 0.3793 57.7263 0.7979 18.1553 181.7207 13.3782 15.4568 11.4961 13.4228 42.2303 43.7872 0.2784 25.8317 28.0282 5.2724 23.0153 373.4477 271.8550 28.9566 24.4098 14.6410
temp: 298.150 k
press: 1.00000 atm
elementType: 8 8 8 8 8 8 8 8 6 6 6 6 6 6 6 6 6 1 1 1 1 1 1 1 1 1 1 1 1 1 1 1 1
symmnumber: 1
zpe: 675513.2 jmol-1
zpe.correction: 0.257289 hartree
zpe.thermalcorrener: 0.275737 hartree
zpe.thermalcorrenthalpy: 0.276681 hartree
zpe.thermalcorrgfe: 0.209975 hartree
zpe.sumelectzpe: -952.953275 hartree
zpe.sumelectthermal: -952.934828 hartree
zpe.sumelectthermalent: -952.933883 hartree
zpe.sumelectthermalfe: -953.000590 hartree
dipole: -1.1306 3.6899 1.5297
dipole: 4.1513
quadrupole: -88.5319 -97.2715 -107.1217
quadrupole: 7.5575 3.3623 -4.7884
quadrupole: 9.1098 0.3702 -9.4800 7.5575 3.3623 -4.7884
hfenergy: -953.2105649 hartree
pointgroup: C01 [X(C9H16O8)]
dipole: -0.5032822 1.4900731 0.440362 debye
polarizability: 155.2824492|10.8775763|108.0883473|-0.8590907|-4.2634926|108.7260195 unknown
InChI: InChI=1S/C9H16O8/c1-9(2)16-6(8(15)17-9)4(11)3(10)5(12)7(13)14/h3-6,8,10-13,15H,1-2H3
charge 0 multiplicity 1
33 atoms
O  -2.277422 -0.947445 -0.179611
O  -3.044739 1.125258 0.691614
O  0.486974 -2.01659 -0.154471
O  -1.150298 1.848957 -0.631053
O  1.611637 -0.401003 1.621005
O  2.89483 -1.205834 -1.110099
O  4.666054 1.283313 -0.939225
O  4.100834 0.623282 1.203809
C  -1.16003 -0.297724 0.535577
C  0.134828 -0.579353 -0.238278
C  -3.514155 -0.175337 0.080769
C  -1.59886 1.183677 0.592731
C  1.343398 0.218639 0.31318
C  2.543991 0.147225 -0.674813
C  -4.197724 0.087102 -1.260223
C  -4.388422 -0.869615 1.127222
C  3.817256 0.698591 -0.022717
H  -1.076785 -0.687621 1.570113
H  -0.035718 -0.367811 -1.304163
H  -1.246636 1.727582 1.488097
H  1.075849 1.286412 0.431575
H  2.292105 0.772183 -1.554996
H  -4.486592 -0.870353 -1.727102
H  -5.104009 0.699717 -1.115136
H  -3.502157 0.613673 -1.933073
H  -3.805033 -1.070976 2.041191
H  -5.247956 -0.229727 1.391795
H  -4.764862 -1.82678 0.727962
H  0.783035 -2.153248 0.790912
H  -1.607054 2.725795 -0.696376
H  2.542532 -0.151148 1.89497
H  2.108538 -1.80297 -0.893505
H  5.516087 1.558128 -0.496282
