program: Gaussian 09
title: 000298282
version: EM64L-G09RevD.01
frameworkgroup: C1[X(C9H14Cl2O4)]
method: RPBEPBE
basis: SDD
operation: Freq
keyword: #p
keyword: freq=noraman
keyword: PBEPBE/SDD
title: #p freq=noraman PBEPBE/SDD
converged: YES YES NO NO
title: Mulliken charges:
elementType: Cl Cl O O O O C C C C C C C C C H H H H H H H H H H H H H H
charge: -0.046747 -0.052024 -0.235730 -0.281198 -0.253005 -0.233289 0.017657 -0.477177 -0.418141 0.120588 -0.020192 -0.660577 0.299659 -0.506396 -0.756947 0.301916 0.224356 0.280825 0.283063 0.223649 0.182629 0.301476 0.268342 0.235818 0.252647 0.201871 0.255283 0.244788 0.246857
chargesum: 0.00000
title: Mulliken charges with hydrogens summed into heavy atoms:
elementType: Cl Cl O O O O C C C C C C C C C
charge: -0.046747 -0.052024 -0.235730 -0.281198 -0.253005 -0.233289 0.319572 0.028004 -0.135078 0.344237 0.162437 -0.090759 0.299659 0.183940 -0.010019
polarizability: 1.51065003e+02 2.75038093e+00 1.26791476e+02 1.77525236e+00 7.69264135e+00 1.04504038e+02
1716.lowfreq: -9.4546 0.0005 0.0020 0.0022 3.8769 6.0061 10.2264 35.0125 38.9000
frequency: 8.7100 34.9692 38.8417 56.9266 69.8781 71.0073 99.7132 105.5067 145.7069 148.5908 179.1554 203.1232 225.2157 258.9690 267.9402 303.8287 336.9320 415.2098 427.9532 475.7030 488.5597 501.4693 535.8303 560.3669 574.7119 622.8539 700.5877 738.2805 819.7928 846.5792 865.5608 910.4942 933.6430 935.1081 965.9021 983.9266 1002.7338 1017.7622 1041.9509 1073.2336 1106.3428 1110.3910 1116.7087 1137.8727 1161.6318 1189.6484 1194.8208 1200.5424 1212.5044 1249.6069 1262.2972 1267.8585 1298.4244 1311.5078 1318.1916 1344.4900 1358.5093 1373.7329 1383.3190 1433.4532 1435.9762 1452.7767 1453.4084 1455.0716 1455.5620 1480.0311 1665.8581 2873.7241 2908.8926 2962.1147 2983.9050 3007.9872 3066.5354 3068.5658 3071.3845 3072.5857 3084.6939 3099.1275 3131.5128 3143.0578 3164.0328
redmass: 5.7490 3.9252 1.3640 6.1385 3.4076 5.1638 2.7481 6.5151 2.5332 1.6671 6.0082 4.1266 4.2802 5.0355 5.0462 3.3784 4.3597 3.2460 3.8366 4.4053 3.8027 5.5240 4.8414 3.2844 4.3293 4.8700 6.2668 4.7223 3.3474 3.8446 2.1960 3.1542 3.7892 5.2984 3.0329 2.5627 2.7157 2.4690 1.6548 2.2243 2.3543 1.7708 1.3154 2.2477 1.6381 1.7617 2.1858 1.3104 1.3709 1.3049 1.4054 1.1963 1.2911 1.2881 1.3622 1.3851 1.4527 1.4956 1.2566 1.1057 1.1764 1.0646 1.0818 1.0532 1.0499 1.0536 9.8889 1.0826 1.0812 1.0373 1.0664 1.0374 1.0859 1.0840 1.0958 1.0609 1.0955 1.0959 1.1031 1.1017 1.1092
irintensity: 1.3856 0.1701 0.5022 1.5559 1.3565 3.2960 7.9855 0.8750 3.3288 2.5759 1.0744 0.5245 9.0184 1.8634 4.8033 5.3651 5.4870 3.2851 1.6986 14.6833 11.7524 8.0887 10.9870 6.4714 18.6921 10.5935 54.7721 1.8462 5.2378 4.2370 30.6610 30.4124 22.1126 155.1613 46.0581 25.5533 200.1549 44.9920 8.7335 50.5478 28.8786 28.3615 10.0482 20.6678 45.9893 151.9960 193.9257 12.5761 16.7097 9.5090 15.6809 6.5123 23.3919 1.4738 3.4289 8.4436 0.7239 19.1813 54.9578 14.1215 6.7514 29.8269 19.5106 12.0012 13.2830 13.4073 184.4052 54.5684 31.0689 60.5070 14.3863 2.0695 14.5754 10.4430 32.9679 16.2377 3.8834 7.7860 19.3255 10.0024 3.6335
temp: 298.150 k
press: 1.00000 atm
elementType: 17 17 8 8 8 8 6 6 6 6 6 6 6 6 6 1 1 1 1 1 1 1 1 1 1 1 1 1 1
symmnumber: 1
zpe: 586540.3 jmol-1
zpe.correction: 0.223401 hartree
zpe.thermalcorrener: 0.240525 hartree
zpe.thermalcorrenthalpy: 0.241469 hartree
zpe.thermalcorrgfe: 0.174477 hartree
zpe.sumelectzpe: -1571.166244 hartree
zpe.sumelectthermal: -1571.149120 hartree
zpe.sumelectthermalent: -1571.148176 hartree
zpe.sumelectthermalfe: -1571.215168 hartree
dipole: -0.6576 0.9098 4.5878
dipole: 4.7231
quadrupole: -106.9939 -98.5980 -103.1154
quadrupole: -9.7280 -6.7635 -6.2696
quadrupole: -4.0914 4.3044 -0.2130 -9.7280 -6.7635 -6.2696
hfenergy: -1571.3896452 hartree
pointgroup: C01 [X(C9H14Cl2O4)]
dipole: -0.2647832 -0.0628046 -1.8381813 debye
polarizability: 151.1995102|0.9071495|123.2367934|-3.7722841|10.7529563|107.924214 unknown
InChI: InChI=1S/C9H14Cl2O4/c1-5(12)14-7-3-6(11)8(4-10)15-9(7)13-2/h6-9H,3-4H2,1-2H3
charge 0 multiplicity 1
29 atoms
Cl 1.104499 2.637973 1.403211
Cl 4.677062 -0.247279 -0.622393
O  1.527239 -0.41233 0.25401
O  -2.065292 -0.178882 -0.748266
O  -0.186546 -2.005066 0.474204
O  -3.327965 0.450309 1.118713
C  -0.81274 0.249581 -0.076227
C  -0.341852 1.551229 -0.756959
C  1.09257 1.944704 -0.372954
C  2.051811 0.737192 -0.485101
C  0.214875 -0.873162 -0.276591
C  3.452279 1.018255 0.047212
C  -3.262997 -0.073443 -0.011782
C  0.671389 -3.18749 0.269456
C  -4.401083 -0.689731 -0.792623
H  -0.995302 0.395701 1.002442
H  -0.36811 1.399478 -1.856304
H  -1.039239 2.37134 -0.51984
H  1.451272 2.790614 -0.982252
H  2.107198 0.496734 -1.574498
H  0.347262 -1.110722 -1.362935
H  3.481261 0.928312 1.14094
H  3.827651 1.998835 -0.280203
H  0.214983 -3.987706 0.870045
H  1.699549 -2.984297 0.614433
H  0.684777 -3.479726 -0.800561
H  -4.316531 -1.790669 -0.751419
H  -4.354615 -0.392645 -1.852914
H  -5.361405 -0.387609 -0.350443
