program: Gaussian 09
title: 000298250
version: EM64L-G09RevD.01
frameworkgroup: C1[X(C7H10Cl2O6S)]
method: RPBEPBE
basis: SDD
operation: Freq
keyword: #p
keyword: freq=noraman
keyword: PBEPBE/SDD
title: #p freq=noraman PBEPBE/SDD
converged: NO YES NO NO
title: Mulliken charges:
elementType: Cl Cl S O O O O O O C C C C C C C H H H H H H H H H H
charge: -0.013644 -0.042041 1.161891 -0.210569 -0.362609 -0.352701 -0.278723 -0.436896 -0.430173 -0.092545 -0.111652 -0.482605 0.064212 -0.052726 -0.649456 -0.513467 0.301514 0.318544 0.331704 0.286216 0.256450 0.309256 0.290302 0.238745 0.250862 0.220111
chargesum: 0.00000
title: Mulliken charges with hydrogens summed into heavy atoms:
elementType: Cl Cl S O O O O O O C C C C C C C
charge: -0.013644 -0.042041 1.161891 -0.210569 -0.362609 -0.352701 -0.278723 -0.436896 -0.430173 0.208969 0.206892 -0.150901 0.350427 0.203724 -0.049898 0.196251
polarizability: 1.73881078e+02 7.89153591e+00 1.34749410e+02 8.83130467e+00 8.62149503e+00 1.14531114e+02
1716.lowfreq: -6.0397 -0.0019 -0.0005 0.0017 6.1710 10.1926 28.9622 48.3337 59.6409
frequency: 28.5708 48.3311 59.6192 88.3162 110.8786 115.7958 138.7417 154.1319 174.1432 181.6101 185.6190 216.7584 226.5540 241.2382 270.8995 284.0363 328.2182 353.0215 367.8701 419.4438 460.5161 470.4905 484.5932 503.6425 534.1646 595.6352 634.8227 681.5073 720.2737 740.9488 807.4701 853.2446 864.6506 888.6327 902.4094 919.9009 964.2958 987.1333 997.2075 1004.6847 1040.5535 1069.3873 1078.4846 1119.6689 1125.2334 1152.9204 1174.1856 1203.7441 1216.4213 1241.4705 1244.4408 1274.6359 1300.8832 1306.6985 1319.4210 1335.7645 1350.8047 1355.6096 1435.1744 1436.5785 1460.8039 1482.5419 2967.9561 3014.9533 3034.0152 3039.4325 3055.6019 3064.1200 3067.6969 3106.1597 3128.1092 3166.0677
redmass: 9.9569 9.9226 8.1914 8.4213 14.0307 4.8531 1.6882 5.2525 2.4148 3.7484 7.1226 5.3915 8.7975 11.6330 8.7600 8.1323 6.7431 8.9502 10.7918 3.6109 10.6616 10.0061 7.7682 8.2673 6.1682 7.6257 5.9612 6.4200 5.8347 4.3555 3.8783 3.1117 5.2775 12.7893 6.1356 2.9389 6.2228 2.8053 5.8397 19.6494 3.5376 3.3898 2.6372 1.2916 1.7786 1.3968 1.4383 1.5176 1.3158 1.2210 1.1684 1.3763 1.2229 1.2577 1.2851 1.2071 1.3362 1.2274 1.1210 1.1105 1.0487 1.0526 1.0328 1.0859 1.0851 1.0859 1.0856 1.1023 1.0599 1.0882 1.1017 1.1077
irintensity: 0.8156 0.0377 0.4281 3.2677 0.2388 0.2836 9.0024 2.6386 9.2588 1.7527 0.8872 0.9880 1.0076 3.1985 0.8107 15.3394 6.4553 8.7923 19.2087 25.1035 35.3688 27.8705 42.4258 43.4599 3.5808 1.4112 16.3127 39.9275 31.9630 43.3606 19.9443 10.6173 55.3742 112.5121 29.9043 11.2831 41.9071 23.3808 130.2193 90.7495 56.9555 11.5856 35.6231 1.1022 8.2452 8.8255 17.1151 11.9017 14.4622 10.8659 5.9553 5.0641 11.5773 1.7063 0.7472 2.2108 4.6705 1.0108 6.8191 12.7792 11.9493 8.7501 53.1089 18.8344 4.8513 13.7824 10.6126 25.5680 5.8247 2.2844 15.6375 2.2736
temp: 298.150 k
press: 1.00000 atm
elementType: 17 17 16 8 8 8 8 8 8 6 6 6 6 6 6 6 1 1 1 1 1 1 1 1 1 1
symmnumber: 1
zpe: 462832.6 jmol-1
zpe.correction: 0.176284 hartree
zpe.thermalcorrener: 0.193361 hartree
zpe.thermalcorrenthalpy: 0.194305 hartree
zpe.thermalcorrgfe: 0.130285 hartree
zpe.sumelectzpe: -2040.774436 hartree
zpe.sumelectthermal: -2040.757359 hartree
zpe.sumelectthermalent: -2040.756414 hartree
zpe.sumelectthermalfe: -2040.820435 hartree
dipole: 2.9439 2.2846 1.2795
dipole: 3.9400
quadrupole: -133.1817 -116.7547 -112.1475
quadrupole: -0.9027 1.3130 -9.6127
quadrupole: -12.4871 3.9399 8.5471 -0.9027 1.3130 -9.6127
hfenergy: -2040.9507196 hartree
pointgroup: C01 [X(C7H10Cl2O6S1)]
dipole: 1.1184595 -0.0341363 1.0727284 debye
dipolederiv: -0.3898203 -0.0110435 -0.1369232 0.0225891 -0.1454661 -0.0051026 -0.1760557 -0.0584547 -0.4931452 -0.3563116 0.0731158 0.1334089 0.1108126 -0.2308284 -0.0737702 0.2435051 -0.0993743 -0.3336919 1.8583255 -0.1297479 0.3373703 -0.0435785 1.3071785 0.0953916 0.3864953 -0.0196972 1.3930583 -0.7717806 -0.1912324 0.1451959 -0.1914548 -0.7968758 0.09538 0.0756693 0.248798 -0.3623499 -0.6520469 -0.1396425 -0.1867274 -0.0856878 -0.4856079 -0.0202734 -0.1947576 -0.1430026 -0.4582995 -0.5709366 0.2043949 -0.0393021 0.0261613 -0.536145 0.0261587 0.0076561 0.0713063 -0.3232692 -0.6662317 0.4507158 -0.060622 0.2440775 -0.9827298 0.140322 0.0584679 0.2339838 -0.4187271 -0.7669799 0.1005537 -0.1147688 0.1319466 -0.4050976 -0.0080952 0.0091844 -0.0345563 -0.4129946 -0.5167567 0.0470529 -0.0623482 -0.0150962 -0.3758177 -0.0947027 -0.2224811 -0.0234617 -0.6208418 0.1186987 0.0142377 0.0439674 -0.0147973 0.1077474 0.0598579 0.3128717 0.1274691 0.3438632 0.3899431 -0.2150982 0.060185 -0.0629801 0.1066098 0.0131627 -0.2046212 0.1339402 -0.0458781 0.3693903 0.0463513 0.273408 -0.1059774 0.1634584 -0.0871765 0.0828702 0.0167548 0.6155701 0.4520644 0.1534588 -0.0417564 0.284762 0.5081986 0.0351598 0.1134523 -0.005473 -0.0654394 0.7412375 -0.1176446 -0.0181673 -0.0084892 0.9292722 -0.2689988 -0.0800403 -0.632343 0.4923322 0.2841 -0.1391329 -0.2757978 -0.131864 0.1908707 0.1734449 -0.358252 0.1451779 0.4540115 0.3421177 -0.1599275 0.0036308 -0.1426217 0.6095019 -0.0011252 -0.0777306 0.1488567 0.1817713 -0.0406851 0.0433078 0.0265375 0.0334884 0.0048955 -0.0332352 -0.0237313 -0.0509595 -0.0612809 0.0341935 0.0424287 -0.0536654 0.0342916 0.1462275 0.0021894 0.0767873 -0.0140544 0.0790087 0.0496915 -0.0000134 -0.0479688 -0.0229658 -0.0239736 0.0040372 -0.0186849 0.0068701 -0.0083643 0.0665567 -0.0071654 0.0006432 -0.0387699 -0.0238219 0.001219 -0.0162003 0.0537427 0.0038664 -0.0333395 -0.0387906 -0.0300239 -0.0620698 -0.0380087 -0.0252359 -0.0609921 0.0129056 0.0002293 0.0730903 0.0309428 0.0729198 0.0564487 0.0361281 0.0056172 0.0365528 0.0314703 -0.0302332 0.0124948 -0.0418277 0.0400815 -0.044624 -0.0368737 -0.0778747 0.0206176 -0.0630918 0.0241913 0.027408 0.093168 -0.0789275 0.0682261 0.0290582 0.031782 -0.0917672 0.074214 -0.0104585 -0.0024708 0.0219798 0.0657438 -0.0119393 0.0339318 0.0551109 0.1191965 -0.037321 -0.0089564 -0.0519521 -0.1304415 -0.0560933 -0.0298883 -0.0918323 -0.043243 -0.0180123 -0.1237002 0.0660278 unknown
polarizability: 169.6884953|-12.9000932|117.0372169|14.8701421|5.3334382|136.4358908 unknown
InChI: InChI=1S/C7H10Cl2O6S/c1-12-7-6-5(14-16(10,11)15-6)4(9)3(2-8)13-7/h3-7H,2H2,1H3
charge 0 multiplicity 1
26 atoms
Cl 1.531822 1.206678 2.255183
Cl 3.795775 -0.368377 -1.794854
S  -2.883058 0.654615 -0.917921
O  0.697998 -0.455823 -1.06311
O  -1.340089 1.721104 -0.557564
O  -2.382375 -0.547566 0.48331
O  0.812047 -1.915568 0.878444
O  -4.228896 1.386344 -0.465457
O  -2.746286 0.022539 -2.37956
C  -0.700935 1.219103 0.667419
C  -0.975009 -0.31734 0.809561
C  0.800589 1.518975 0.515229
C  1.483464 0.709011 -0.618285
C  -0.040524 -1.206108 -0.050937
C  2.935772 0.339616 -0.280441
C  1.532356 -3.04696 0.257086
H  -1.114397 1.74977 1.543684
H  -0.87488 -0.596884 1.873187
H  0.962937 2.596804 0.374312
H  1.478667 1.35671 -1.51435
H  -0.64249 -1.905054 -0.664287
H  2.98934 -0.429111 0.500183
H  3.518315 1.228287 0.005735
H  2.13941 -3.48765 1.061574
H  2.180782 -2.701301 -0.568638
H  0.812467 -3.797512 -0.124405
