program: Gaussian 09
title: 000299955
version: EM64L-G09RevD.01
frameworkgroup: C1[X(C10H14N6O3)]
method: RPBEPBE
basis: SDD
operation: Freq
keyword: #p
keyword: freq=noraman
keyword: PBEPBE/SDD
title: #p freq=noraman PBEPBE/SDD
converged: YES YES NO NO
title: Mulliken charges:
elementType: O O O N N N N N N C C C C C C C C C C H H H H H H H H H H H H H H
charge: -0.449530 -0.467731 -0.226508 -0.133866 -0.291819 0.054479 -0.124176 -0.063838 -0.577923 -0.115273 -0.103198 -0.480663 -0.107112 -0.551346 -0.437994 0.218050 -0.165539 0.039783 0.017419 0.276803 0.248674 0.223132 0.263996 0.194325 0.276711 0.249484 0.249442 0.225169 0.382309 0.354524 0.353947 0.341142 0.327127
chargesum: 0.00000
title: Mulliken charges with hydrogens summed into heavy atoms:
elementType: O O O N N N N N N C C C C C C C C C C
charge: -0.067221 -0.113784 -0.226508 -0.133866 0.062704 0.054479 -0.124176 -0.063838 0.090346 0.161531 0.145476 0.006465 0.087213 -0.025151 0.036617 0.218050 -0.165539 0.039783 0.017419
polarizability: 2.27422558e+02 1.25088239e+01 1.71971292e+02 1.71610871e+01 -2.40868839e+00 1.05330356e+02
1716.lowfreq: -11.5433 -8.6530 -5.5372 -0.0008 -0.0008 -0.0007 14.0909 38.8953 59.3910
frequency: 13.5504 38.8707 59.3075 70.9283 103.9552 130.0856 153.9547 176.3701 187.9153 226.6143 230.0743 289.6299 300.3054 321.9982 334.7159 341.6328 350.9518 378.0210 417.3731 449.3803 462.4872 488.9667 511.2816 550.3313 569.9578 576.1828 593.8494 618.1079 639.6062 656.7772 667.3961 702.6329 718.2174 746.8754 770.7705 788.9081 800.4111 871.8927 903.6056 920.5272 928.4000 947.5254 951.8890 972.0851 996.4341 1009.5109 1027.6783 1058.3826 1082.7648 1091.0611 1104.8464 1136.9985 1142.5285 1177.5215 1185.6797 1209.6828 1220.8463 1237.8311 1262.3124 1282.9354 1294.0407 1305.8100 1325.6890 1332.7462 1337.7767 1339.3741 1361.5829 1365.9914 1373.7441 1396.6356 1400.3182 1441.2769 1455.3519 1464.6006 1471.2088 1491.7569 1562.8115 1594.3804 1620.0738 2916.8452 2985.8012 3002.4536 3004.8928 3023.3911 3060.9750 3081.4495 3088.0454 3099.5507 3411.4076 3550.2735 3559.9512 3582.0415 3713.0672
redmass: 5.6278 6.2698 5.1326 4.0460 6.2167 4.9840 3.6154 6.0608 7.2864 5.4149 3.5555 5.8919 2.1378 6.3505 4.4219 1.5138 3.6518 1.6063 2.5160 3.2423 5.9188 1.1896 4.4865 3.7633 1.9055 1.4814 5.8026 2.7912 5.1294 7.3102 9.1607 1.1292 11.2756 3.6615 3.7434 11.7354 9.4794 1.9143 2.4564 2.6994 2.0257 5.9144 5.8678 2.1578 2.3541 4.2123 2.5760 1.8333 1.9545 2.0844 3.1183 2.1358 2.1814 1.9411 2.5301 2.1794 1.5982 3.0885 1.2058 1.2984 1.3046 1.2809 1.3173 1.2950 1.4642 3.0560 2.9575 1.4322 1.2039 3.9708 1.4756 3.5454 1.1145 1.0812 1.0842 3.4814 5.1742 2.6705 3.6205 1.0852 1.0844 1.0649 1.0648 1.0623 1.0873 1.1011 1.1029 1.1006 1.0656 1.0443 1.0821 1.0666 1.1060
irintensity: 2.4190 7.3087 7.7304 1.0516 7.0538 2.8601 10.4378 6.8840 0.6452 1.8051 1.9900 0.7568 65.4723 1.4093 3.8225 169.4435 98.3676 203.3631 38.9698 13.6959 8.5907 246.0401 12.5403 30.9318 52.0807 5.3944 0.5419 12.4293 10.5142 12.6395 7.6296 179.7106 14.8482 10.5539 8.6409 9.9173 0.0278 10.5959 1.1696 22.7562 22.3627 59.6657 1.3516 58.3967 21.7826 40.6150 44.7968 9.8455 40.4836 16.4044 17.0393 57.9773 7.2091 42.3297 4.4966 52.7130 1.0794 160.0981 4.0926 8.3249 9.3733 58.1619 5.5736 17.2724 2.8163 33.0261 270.8491 2.2536 33.6533 118.4566 22.8238 73.1325 25.7205 13.6147 5.7009 262.7795 233.2933 873.2305 13.6681 67.4288 22.4224 15.9359 45.8555 11.8027 4.1398 12.3669 15.8026 19.0762 103.0002 168.2092 115.9934 12.0455 48.3999
temp: 298.150 k
press: 1.00000 atm
elementType: 8 8 8 7 7 7 7 7 7 6 6 6 6 6 6 6 6 6 6 1 1 1 1 1 1 1 1 1 1 1 1 1 1
symmnumber: 1
zpe: 670965.4 jmol-1
zpe.correction: 0.255557 hartree
zpe.thermalcorrener: 0.272627 hartree
zpe.thermalcorrenthalpy: 0.273571 hartree
zpe.thermalcorrgfe: 0.209508 hartree
zpe.sumelectzpe: -942.160294 hartree
zpe.sumelectthermal: -942.143225 hartree
zpe.sumelectthermalent: -942.142281 hartree
zpe.sumelectthermalfe: -942.206344 hartree
dipole: -7.3690 4.3496 -0.0037
dipole: 8.5569
quadrupole: -148.3229 -108.8612 -107.1492
quadrupole: 31.9924 -13.5807 3.9513
quadrupole: -26.8785 12.5832 14.2952 31.9924 -13.5807 3.9513
hfenergy: -942.4158516 hartree
pointgroup: C01 [X(C10H14N6O3)]
dipole: -2.9209204 -1.5288316 -0.6815803 debye
polarizability: 224.9605717|-0.3603976|158.1544524|-26.9016784|26.8945777|121.6091815 unknown
InChI: InChI=1S/C10H14N6O3/c11-10-12-8-7(9(19)13-10)14-15-16(8)5-1-4(3-17)6(18)2-5/h4-6,15,17-18H,1-3,11H2
charge 0 multiplicity 1
33 atoms
O  -4.53163 -0.63277 1.284175
O  -5.198775 1.101755 -0.748502
O  3.962236 2.31192 0.427418
N  0.042031 -0.255863 0.720786
N  -0.11684 1.046504 1.265739
N  1.056209 1.754871 1.250663
N  1.889465 -1.283793 -0.494223
N  3.921665 0.172445 -0.563987
N  3.866716 -1.935775 -1.548278
C  -1.072977 -1.188258 0.439799
C  -2.871589 0.250253 -0.438673
C  -1.830779 -0.821056 -0.867226
C  -3.201417 -0.064679 1.075951
C  -2.172976 -1.13931 1.525572
C  -4.132961 0.242936 -1.320118
C  1.329591 -0.294459 0.205939
C  1.93737 0.975787 0.574045
C  3.35022 1.237857 0.156813
C  3.223892 -0.952966 -0.836919
H  -0.580767 -2.172821 0.363071
H  -2.401783 1.253235 -0.492633
H  -2.344315 -1.733781 -1.22692
H  -1.143716 -0.487862 -1.662951
H  -3.110463 0.873084 1.669549
H  -2.71219 -2.102542 1.52747
H  -1.778249 -0.988284 2.545472
H  -4.582962 -0.762095 -1.340686
H  -3.899311 0.554352 -2.356706
H  -5.18892 0.009149 0.889174
H  -0.81758 1.216917 1.989945
H  -4.965447 2.055612 -0.869218
H  4.831436 -1.776252 -1.828217
H  3.377417 -2.799113 -1.769029
