program: Gaussian 09
title: 000299948
version: EM64L-G09RevD.01
frameworkgroup: C1[X(C17H16N2O2)]
method: RPBEPBE
basis: SDD
operation: Freq
keyword: #p
keyword: freq=noraman
keyword: PBEPBE/SDD
title: #p freq=noraman PBEPBE/SDD
converged: YES YES NO NO
title: Mulliken charges:
elementType: O O N N C C C C C C C C C C C C C C C C C H H H H H H H H H H H H H H H H
charge: -0.275389 -0.275392 -0.192725 -0.192734 -0.393023 -0.393023 -0.266271 0.129729 0.129760 0.248151 0.248147 -0.359665 -0.359635 -0.307754 -0.307695 -0.222663 -0.222671 -0.250120 -0.250144 -0.226551 -0.226548 0.283136 0.243154 0.283133 0.243155 0.251130 0.251152 0.269843 0.269842 0.235310 0.235293 0.233744 0.233743 0.232904 0.232904 0.233888 0.233887
chargesum: 0.00000
title: Mulliken charges with hydrogens summed into heavy atoms:
elementType: O O N N C C C C C C C C C C C C C C C C C
charge: -0.275389 -0.275392 -0.192725 -0.192734 0.133267 0.133266 0.236010 0.129729 0.129760 0.248151 0.248147 -0.089822 -0.089794 -0.072443 -0.072402 0.011081 0.011071 -0.017216 -0.017239 0.007337 0.007339
polarizability: 2.36511310e+02 -2.47747320e-03 2.37707536e+02 -3.81247129e+01 -2.25672618e-03 1.19563612e+02
1716.lowfreq: -4.5380 0.0006 0.0007 0.0011 0.7281 4.1235 28.3443 30.7670 39.3870
frequency: 28.3333 30.7654 39.3857 59.0702 63.1909 88.8118 108.6866 112.2900 176.4381 193.1922 201.7814 240.5930 290.6838 292.5599 328.2339 339.2086 371.8307 400.4343 404.6343 405.2620 425.4594 490.4718 557.8596 613.1963 614.0561 626.2739 641.7681 660.1410 690.2543 691.7899 706.3453 707.0775 723.6321 788.9693 789.9909 793.2299 859.0279 860.8761 879.4466 898.6689 912.8925 937.4847 939.1466 982.9493 983.5404 989.6817 990.0216 993.6300 1002.9876 1003.2142 1024.8340 1027.3085 1049.2667 1080.7732 1084.3220 1090.3475 1124.0846 1148.6137 1149.4539 1162.9612 1174.3338 1174.3845 1188.9818 1190.4679 1217.3939 1218.2401 1240.7719 1306.8215 1317.0192 1317.2419 1328.2011 1344.3792 1368.2791 1381.8367 1381.8570 1393.4297 1432.7686 1432.8140 1480.5525 1481.3956 1485.9049 1487.9921 1498.1703 1550.8152 1554.9754 1591.5654 1592.4310 1609.9428 1609.9511 2978.3344 3001.4601 3008.7340 3032.4559 3099.0424 3106.6314 3128.4815 3128.5765 3137.1819 3137.3271 3148.8096 3149.0069 3159.8277 3159.9264 3170.6210 3170.6994
redmass: 4.9332 4.4304 6.4974 5.1910 4.1301 3.6271 4.5787 3.9872 4.7935 3.8647 4.7321 3.3450 5.4402 3.3886 4.4547 4.5318 7.1417 4.7632 2.8603 2.8569 4.5010 4.2654 5.4864 6.4058 6.4395 3.0480 6.1351 6.3158 6.1020 5.4460 1.7389 1.5756 2.8955 2.3617 2.3603 5.0103 1.2469 1.2477 2.3166 4.8154 2.5795 1.4471 1.4783 1.3869 1.3861 4.8678 5.8922 2.3208 1.3398 1.3492 2.3296 2.2155 1.5700 1.6708 1.5902 1.7305 2.0054 3.7868 2.7361 1.7994 1.0569 1.0554 1.1174 1.1469 1.9726 1.6516 1.6319 1.3447 1.3360 1.3331 1.4612 2.4576 1.7336 8.6759 8.7488 4.6021 2.2426 2.2380 2.0785 2.2165 1.1447 1.1163 1.1185 8.9817 8.1219 6.4423 6.4871 6.0215 6.0165 1.0559 1.0690 1.0634 1.1090 1.0969 1.1013 1.0849 1.0849 1.0881 1.0881 1.0929 1.0929 1.0962 1.0962 1.1008 1.1009
irintensity: 0.0001 2.8873 0.0759 10.2082 0.0655 0.1800 2.2128 0.4296 2.8043 0.6750 2.0598 4.9669 18.6154 3.2700 0.4106 1.4113 5.7226 3.2964 0.0160 0.0280 3.9683 11.5973 1.8727 0.1122 0.2098 4.2947 33.9655 10.5444 0.0187 10.4328 167.7273 0.6071 10.9924 6.4173 63.8317 2.6821 2.4549 2.9201 29.4275 4.2069 14.9975 10.2539 0.5992 2.7905 1.2768 1.4799 0.7098 2.7147 0.8746 0.3230 11.0528 11.7520 0.9223 0.3750 34.9704 1.1946 71.8242 26.9809 0.1612 4.5361 0.0331 0.3184 13.1909 2.7901 64.0112 0.6177 93.2676 7.2679 1.5573 0.0034 0.4046 351.4559 299.3540 1.4976 1.1239 142.8022 1.0435 19.4323 15.6555 3.4814 11.1562 20.5922 4.9552 332.3777 106.6065 33.2403 12.6571 6.4077 2.7766 36.1838 25.6300 37.5245 18.9544 2.4730 8.5821 1.8162 0.3312 0.6590 6.3778 46.9861 5.7107 17.8675 17.6784 11.4709 19.6407
temp: 298.150 k
press: 1.00000 atm
elementType: 8 8 7 7 6 6 6 6 6 6 6 6 6 6 6 6 6 6 6 6 6 1 1 1 1 1 1 1 1 1 1 1 1 1 1 1 1
symmnumber: 1
zpe: 771241.3 jmol-1
zpe.correction: 0.293750 hartree
zpe.thermalcorrener: 0.311500 hartree
zpe.thermalcorrenthalpy: 0.312444 hartree
zpe.thermalcorrgfe: 0.245750 hartree
zpe.sumelectzpe: -915.885146 hartree
zpe.sumelectthermal: -915.867397 hartree
zpe.sumelectthermalent: -915.866452 hartree
zpe.sumelectthermalfe: -915.933146 hartree
dipole: 0.0001 -4.7694 0.0003
dipole: 4.7694
quadrupole: -135.5003 -115.2981 -120.9496
quadrupole: -0.0010 -13.4377 0.0002
quadrupole: -11.5843 8.6179 2.9664 -0.0010 -13.4377 0.0002
hfenergy: -916.1788966 hartree
pointgroup: C01 [X(C17H16N2O2)]
dipole: -0.000125 1.8764212 0.0000381 debye
polarizability: 222.2910567|-0.0015091|237.7075358|53.9842948|0.0003817|133.7838663 unknown
InChI: InChI=1S/C17H16N2O2/c20-16(14-7-3-1-4-8-14)18-11-12-19(13-18)17(21)15-9-5-2-6-10-15/h1-10H,11-13H2
charge 0 multiplicity 1
37 atoms
O  -3.310024 -2.291571 -0.121549
O  3.310291 -2.291232 0.121543
N  -1.13595 -1.568894 0.258989
N  1.136082 -1.568798 -0.258762
C  -0.64534 -2.962762 0.421244
C  0.645588 -2.9627 -0.421066
C  0.000026 -0.647043 0.000072
C  -2.477444 -1.330804 -0.045458
C  2.477543 -1.330588 0.045746
C  -2.919814 0.091492 -0.276761
C  2.91978 0.091781 0.276823
C  -3.946851 0.30492 -1.233436
C  3.947119 0.305416 1.233127
C  -2.432847 1.192652 0.474204
C  2.432339 1.192832 -0.473992
C  -4.449899 1.601867 -1.463144
C  4.450025 1.602458 1.46261
C  -2.950765 2.488855 0.256298
C  2.950107 2.489134 -0.256312
C  -3.951448 2.698875 -0.719991
C  3.951114 2.699355 0.719602
H  -1.42181 -3.655252 0.061472
H  -0.43104 -3.177395 1.484697
H  1.422115 -3.655137 -0.061316
H  0.431299 -3.177307 -1.484527
H  -0.242718 -0.001061 -0.863958
H  0.242714 -0.000962 0.864039
H  -4.346442 -0.560389 -1.771973
H  4.347049 -0.559808 1.77155
H  -1.684517 1.039956 1.259473
H  1.683728 1.039981 -1.258965
H  -5.235216 1.757716 -2.210758
H  5.235584 1.758469 2.209937
H  -2.580726 3.329522 0.853278
H  2.579696 3.329719 -0.853175
H  -4.349407 3.705273 -0.891065
H  4.348958 3.705828 0.890502
