program: Gaussian 09
title: 000299908
version: EM64L-G09RevD.01
frameworkgroup: C1[X(C7H6ClNO2)]
method: RPBEPBE
basis: SDD
operation: Freq
keyword: #p
keyword: freq=noraman
keyword: PBEPBE/SDD
title: #p freq=noraman PBEPBE/SDD
converged: YES YES NO NO
title: Mulliken charges:
elementType: Cl O O N C C C C C C C H H H H H H
charge: -0.039440 -0.313547 -0.257315 -0.611573 0.491848 -0.316109 -0.304242 -0.211786 -0.216176 -0.236972 0.284114 0.307774 0.256852 0.233827 0.235151 0.351942 0.345652
chargesum: 0.00000
title: Mulliken charges with hydrogens summed into heavy atoms:
elementType: Cl O O N C C C C C C C
charge: -0.039440 -0.313547 -0.257315 0.086021 0.491848 -0.316109 0.003532 0.045066 0.017651 -0.001821 0.284114
polarizability: 1.28425135e+02 -9.56540403e+00 1.20185924e+02 -4.68685858e-02 1.43282110e-02 3.83263938e+01
1716.lowfreq: -5.7915 -5.2879 0.0022 0.0024 0.0026 4.7494 21.6689 64.3326 130.8746
frequency: 21.6455 64.3320 130.8744 150.3682 220.8892 263.9459 319.6684 388.3201 425.5196 436.7813 515.9083 537.5671 540.3469 550.0382 645.0781 681.9077 690.0249 711.8240 738.2062 760.6224 866.6001 925.9237 947.0435 986.1205 1018.2599 1042.4694 1067.6338 1128.7339 1170.6732 1219.8542 1261.1939 1293.3803 1373.5134 1428.1181 1462.5351 1575.4325 1588.1712 1601.7387 1707.6100 3142.2698 3158.6330 3175.5674 3201.2045 3555.3220 3713.9934
redmass: 8.4669 4.9758 7.6668 5.7974 10.3143 5.7953 5.7210 5.7388 7.9114 3.2703 1.2126 2.7584 4.2337 1.1671 6.5339 8.2780 10.3280 4.6567 5.8372 1.2166 1.3400 7.5101 1.3538 1.3062 6.4607 2.0802 2.0229 1.5659 1.0895 3.2768 1.4814 3.3465 9.9105 2.2677 2.5644 6.5439 1.2399 5.9034 8.0513 1.0864 1.0922 1.0987 1.0948 1.0448 1.1060
irintensity: 5.1698 8.7584 5.8376 1.3725 3.4234 0.1856 1.0795 2.8943 4.6624 8.9471 105.6697 51.2465 17.3307 164.7011 5.6892 24.1688 41.2494 0.6044 8.2439 109.3277 3.6629 112.0305 5.8758 1.6090 61.3938 40.8381 19.2772 6.3674 14.4316 332.6479 35.5679 482.2619 16.6536 23.0910 151.0618 13.6860 132.2172 0.9664 321.3156 3.3864 12.4675 10.2861 7.7117 90.5296 59.8652
temp: 298.150 k
press: 1.00000 atm
elementType: 17 8 8 7 6 6 6 6 6 6 6 1 1 1 1 1 1
symmnumber: 1
zpe: 313456.7 jmol-1
zpe.correction: 0.119389 hartree
zpe.thermalcorrener: 0.129385 hartree
zpe.thermalcorrenthalpy: 0.130329 hartree
zpe.thermalcorrgfe: 0.082168 hartree
zpe.sumelectzpe: -934.821607 hartree
zpe.sumelectthermal: -934.811611 hartree
zpe.sumelectthermalent: -934.810667 hartree
zpe.sumelectthermalfe: -934.858828 hartree
dipole: -0.6992 0.7957 0.0076
dipole: 1.0593
quadrupole: -51.8978 -69.4084 -73.7017
quadrupole: -12.4050 -0.0398 -0.0312
quadrupole: 13.1049 -4.4058 -8.6991 -12.4050 -0.0398 -0.0312
hfenergy: -934.9409961 hartree
pointgroup: C01 [X(C7H6Cl1N1O2)]
dipole: 0.3509803 -0.2183784 0.0529426 debye
dipolederiv: -0.1832156 0.2301117 -0.0369198 0.2265065 -0.6258459 0.0854848 -0.0365143 0.0856041 -0.0655542 -2.2138764 -0.4471033 -0.0746092 -0.7090789 -0.5683693 0.0034894 -0.0408664 0.0211892 -0.1920042 -0.738105 -0.0015387 -0.02523 -0.15184 -1.0612731 0.0829171 -0.0045869 0.0927921 -0.3600836 -1.3595149 0.2832057 -0.0771817 0.4085889 -0.4502208 -0.0106238 -0.092358 -0.0186521 -0.742479 1.4595145 0.2932783 0.0514995 -0.1248533 -0.137323 0.0257788 0.1057936 0.0530806 0.1295813 -0.0000973 -0.3851466 0.0544948 -0.393257 0.8790675 -0.1467903 0.0552062 -0.1460173 -0.0799705 -0.2513341 -0.0870742 0.0041669 0.1740119 -0.0635202 0.0007884 -0.0288684 -0.0172424 -0.1504513 -0.0307194 0.0962394 -0.0073007 0.0979762 -0.135903 0.0111221 -0.0072472 0.0109181 -0.1008282 0.0216103 -0.0033898 0.012423 -0.0649796 0.1169267 -0.0376891 0.0197618 -0.0340557 -0.1498715 0.0237959 -0.0020917 0.0132509 -0.0104172 -0.0529314 -0.0154798 0.0139544 -0.0147092 -0.1689995 2.6153616 0.0567137 0.1366924 0.5808062 1.6514407 -0.1293031 0.0673724 -0.1636381 0.3943264 0.1635184 -0.027742 0.0015855 -0.0324496 0.0659457 0.012603 0.0019659 0.0133663 0.1853185 0.0518564 -0.0615665 0.0000378 -0.0743886 -0.0041412 0.0159441 0.00162 0.016821 0.1638698 0.0425963 0.0631727 -0.0156268 0.0824074 -0.0674949 0.0336598 -0.017962 0.0325278 0.1566457 -0.1110374 0.0225641 -0.0212945 0.0176554 0.0771276 0.0124445 -0.0206695 0.0128051 0.165871 0.24452 -0.0107517 -0.0094229 -0.0665816 0.1956873 0.0237673 -0.0019889 0.0272144 0.4110706 0.2651266 -0.0188811 -0.006565 0.0398934 0.1808272 0.0318868 -0.0146128 0.0279961 0.4035587 unknown
polarizability: 132.5330988|-5.027498|114.4182279|6.7870261|-9.7841811|39.9861258 unknown
InChI: InChI=1S/C7H6ClNO2/c8-5-3-1-2-4-6(5)11-7(9)10/h1-4H,9H2
charge 0 multiplicity 1
17 atoms
Cl -0.182646 -2.746232 0.381628
O  1.295024 -0.222145 0.172309
O  2.155119 1.999045 -0.062655
N  3.513175 0.114343 0.26814
C  -0.085883 0.040027 0.046035
C  -0.920484 -1.103428 0.130954
C  -0.671597 1.31457 -0.149705
C  -2.317844 -0.992706 0.02435
C  -2.075997 1.422715 -0.256551
C  -2.901362 0.2803 -0.170824
C  2.317257 0.770474 0.107313
H  -0.028893 2.193481 -0.215755
H  -2.936198 -1.892362 0.093731
H  -2.520849 2.411739 -0.407951
H  -3.989057 0.369796 -0.253864
H  3.530806 -0.894667 0.398964
H  4.37233 0.65645 0.25298
