program: Gaussian 09
title: 000027010
version: EM64L-G09RevD.01
frameworkgroup: C1[X(C8H16O)]
method: RPBEPBE
basis: SDD
operation: Freq
keyword: #pfreq=noraman
keyword: PBEPBE/SDD
title: #p freq=noraman PBEPBE/SDD
converged: YES YES NO NO
title: Mulliken charges:
elementType: O C C C C C C C C H H H H H H H H H H H H H H H H
charge: -0.319918 0.386737 0.386749 -0.526450 -0.526547 -0.725901 -0.725464 -0.725883 -0.725469 0.222419 0.226012 0.222424 0.226030 0.200898 0.226446 0.222670 0.199966 0.220061 0.232601 0.226444 0.222650 0.200917 0.199934 0.220078 0.232597
chargesum: 0.00000
title: Mulliken charges with hydrogens summed into heavy atoms:
elementType: O C C C C C C C C
charge: -0.319918 0.386737 0.386749 -0.078019 -0.078093 -0.075887 -0.072836 -0.075873 -0.072861
polarizability: 1.00940180e+02 -1.24315157e-01 8.35640746e+01 -8.80195125e-06 -6.18034405e-04 7.98571683e+01
1716.lowfreq: -0.0008 0.0002 0.0004 15.2488 15.5509 35.4910 48.4708 152.4370 194.0039
frequency: 46.9513 152.4270 194.0038 198.2119 230.5159 244.5941 270.3729 290.6625 330.3569 350.4597 355.7581 409.8848 428.8079 451.8131 558.8773 572.8536 729.6970 733.1853 804.4754 856.5659 905.4133 914.1178 920.3161 937.1244 956.3562 965.5259 984.9985 1012.1696 1027.9314 1078.0296 1117.7740 1135.9956 1215.0353 1216.7215 1239.1343 1265.0457 1267.5842 1309.3805 1320.3150 1371.4261 1373.6078 1387.5082 1388.8992 1449.0635 1449.4381 1461.9404 1463.6021 1466.5420 1473.1331 1475.0294 1476.0119 1480.4181 1484.8622 2977.6863 2977.8055 2981.8812 2982.6923 3002.6840 3007.1401 3063.9302 3073.1436 3073.7876 3076.2167 3079.4935 3080.3737 3088.6787 3090.4496 3092.6563 3093.3795
redmass: 3.3772 2.3363 1.0659 1.0411 1.2293 1.0420 1.5894 2.5089 2.4267 2.1883 2.3141 2.1324 2.2397 2.9707 3.4111 2.9136 2.2136 6.2269 2.5059 3.1260 1.7068 1.7724 1.5048 1.5351 2.0775 1.5062 1.2832 1.6187 1.5481 1.3305 1.8333 2.1683 2.1778 2.1842 2.2087 2.3281 2.7784 1.6866 1.4848 1.2533 1.2430 1.2139 1.2198 1.0498 1.0562 1.0548 1.0513 1.0592 1.0839 1.0770 1.0738 1.0502 1.0590 1.0353 1.0354 1.0359 1.0360 1.0583 1.0649 1.1008 1.0991 1.0993 1.1042 1.0991 1.0988 1.0998 1.1004 1.0997 1.0995
irintensity: 1.8327 0.0022 0.0829 0.1183 0.8194 0.1302 0.0001 0.0444 1.8236 1.5976 0.6138 0.0436 1.1209 5.9275 0.2713 1.7129 4.1016 3.4912 2.6497 52.3460 0.0122 2.9966 5.7555 1.1882 40.8989 0.0003 0.4586 4.5837 1.5949 13.8063 13.7567 100.3191 7.4301 0.2453 1.1850 36.3580 20.4844 24.8785 7.3768 1.0315 60.2434 27.5141 4.2776 0.0429 1.5533 0.7819 0.3458 7.4707 0.0714 35.2971 14.3540 6.7052 4.1846 1.2567 48.7687 44.4237 1.8138 38.0772 19.6066 11.3266 0.4816 33.6114 23.1302 73.1496 21.6097 25.1651 30.6310 54.5679 56.8041
temp: 298.150 k
press: 1.00000 atm
elementType: 8 6 6 6 6 6 6 6 6 1 1 1 1 1 1 1 1 1 1 1 1 1 1 1 1
symmnumber: 1
zpe: 585828.8 jmol-1
zpe.correction: 0.223130 hartree
zpe.thermalcorrener: 0.233768 hartree
zpe.thermalcorrenthalpy: 0.234713 hartree
zpe.thermalcorrgfe: 0.188298 hartree
zpe.sumelectzpe: -388.926525 hartree
zpe.sumelectthermal: -388.915887 hartree
zpe.sumelectthermalent: -388.914943 hartree
zpe.sumelectthermalfe: -388.961358 hartree
dipole: -0.0002 0.0011 1.8118
dipole: 1.8118
quadrupole: -54.5505 -57.2942 -59.1142
quadrupole: -0.0409 -0.0002 -0.0020
quadrupole: 2.4358 -0.3079 -2.1278 -0.0409 -0.0002 -0.0020
hfenergy: -389.1496557 hartree
pointgroup: C01 [X(C8H16O1)]
dipole: 0.0000309 -0.0001672 -0.7128126 debye
dipolederiv: -1.2146881 -0.0794533 0.0002412 -0.0421042 -0.4538239 -0.0001906 0.0000453 0.000095 -0.4404235 0.8101355 0.0522244 0.0340117 0.0630115 0.4074147 -0.0315445 -0.2178363 -0.0632397 0.2830847 0.8102389 0.0519761 -0.0342692 0.0629208 0.4075338 0.0315798 0.2175667 0.0630697 0.282677 -0.0665308 0.049777 -0.0860491 0.0162094 0.0767984 -0.0049258 -0.0142173 -0.0337865 -0.0756735 -0.0666098 0.0500241 0.0858249 0.0163642 0.0769304 0.0044645 0.0142247 0.0333844 -0.07584 -0.0510001 0.053758 -0.0370271 0.0994842 -0.0848488 0.0434572 -0.0528068 0.0576992 0.0299866 -0.0261398 -0.0538193 -0.0261926 -0.104918 -0.175058 0.0020715 -0.0020199 -0.0105068 0.0255816 -0.0509035 0.0537878 0.0368693 0.0997256 -0.0853492 -0.0432672 0.0525109 -0.0575807 0.0302169 -0.0261339 -0.0538407 0.0263371 -0.1049138 -0.1747161 -0.0016256 0.0023606 0.0109027 0.0256461 0.0493083 -0.0182253 -0.0277704 0.0086202 -0.170201 -0.0638385 -0.018697 -0.0211372 0.0634969 -0.0341808 -0.0322027 0.1267957 -0.0587496 0.0495705 0.0824774 0.1096122 0.0454538 -0.0340972 0.0493143 -0.018165 0.0278369 0.0086554 -0.1699918 0.0643933 0.0186831 0.0216848 0.0632937 -0.0342227 -0.0325159 -0.1267038 -0.0590268 0.0492414 -0.0826658 -0.1094402 -0.0456382 -0.0337312 -0.1243639 0.0344382 0.0918132 0.0150878 0.0822635 0.0176688 0.1363195 -0.0078687 0.0096155 0.0659845 0.0057607 -0.0550414 -0.0096674 0.0752309 -0.0667877 -0.1043622 -0.0194798 -0.12465 0.0417871 -0.115871 -0.0057524 -0.0766239 -0.1242748 0.0038574 -0.0170954 -0.0191517 0.0877041 -0.1497088 -0.0386 0.0959445 -0.0064482 0.0719069 -0.0201583 0.1273775 0.0061482 0.031942 0.0055703 0.1254706 -0.0616127 0.0948562 -0.0511568 0.0684052 -0.0596064 0.0843833 0.04632 0.0864897 -0.0229211 -0.0334209 -0.0198469 0.0692134 -0.0291123 -0.0684676 -0.0760587 -0.1229334 0.0659338 0.005909 0.0551261 -0.009455 0.0754233 0.0662836 0.1044246 0.0189511 -0.1248427 0.0415483 -0.1160241 0.0059853 -0.0768479 -0.1240604 -0.0033997 0.0172664 0.0195924 0.087626 -0.1243297 0.0344439 -0.0919067 0.0150537 0.0821958 -0.0177001 -0.1363443 0.007874 0.0095976 -0.1497534 -0.03861 -0.0958134 -0.0065048 0.0719416 0.0201822 -0.1273507 -0.0061161 0.0319356 0.0057854 0.1255143 0.0612886 0.0948284 -0.0516894 -0.0682553 0.0592901 -0.0842468 0.046659 0.0864691 -0.0228359 0.0334852 -0.0197108 0.0695056 0.0286303 0.0685624 0.0755724 -0.1231919 unknown
polarizability: 100.9364428|0.2835203|83.5678105|-0.0011298|-0.0025413|79.85717 unknown
InChI: InChI=1S/C8H16O/c1-7(2)5-6-8(3,4)9-7/h5-6H2,1-4H3
charge 0 multiplicity 1
25 atoms
O  0.000102 0.000169 0.930793
C  1.236471 -0.000632 0.077831
C  -1.236417 0.000826 0.077984
C  0.714645 -0.296578 -1.357889
C  -0.714638 0.293221 -1.358502
C  2.169288 -1.093499 0.62792
C  1.88873 1.396622 0.183929
C  -2.168013 1.095947 0.625742
C  -1.8901 -1.39548 0.187314
H  0.682867 -1.388398 -1.531119
H  1.360492 0.153791 -2.131537
H  -0.682879 1.384599 -1.534444
H  -1.360587 -0.159049 -2.130953
H  3.09536 -1.15961 0.026379
H  2.448712 -0.869896 1.672697
H  1.66347 -2.074547 0.610278
H  2.86383 1.419291 -0.338261
H  1.237352 2.172909 -0.255637
H  2.053285 1.651026 1.245487
H  -2.447781 0.874906 1.670969
H  -1.661084 2.076385 0.606029
H  -3.09395 1.161844 0.023962
H  -2.86529 -1.418342 -0.334695
H  -1.239505 -2.173383 -0.250547
H  -2.054759 -1.647322 1.249468
