program: Gaussian 09
title: 000299892
version: EM64L-G09RevD.01
frameworkgroup: C1[X(C16H24N2O2)]
method: RPBEPBE
basis: SDD
operation: Freq
keyword: #p
keyword: freq=noraman
keyword: PBEPBE/SDD
title: #p freq=noraman PBEPBE/SDD
converged: YES YES NO NO
title: Mulliken charges:
elementType: O O N N C C C C C C C C C C C C C C C C H H H H H H H H H H H H H H H H H H H H H H H H
charge: -0.289488 -0.311367 -0.131776 -0.137236 -0.451839 -0.406730 -0.254532 -0.299970 0.412486 -0.212141 -0.224287 0.200541 0.261638 0.127517 -0.795420 -0.776686 -0.620110 -0.654853 -0.620277 -0.628522 0.273379 0.245638 0.293503 0.273520 0.243056 0.239415 0.222432 0.222029 0.218986 0.204407 0.221359 0.246664 0.280495 0.219008 0.217623 0.216769 0.223706 0.308120 0.284380 0.220850 0.221972 0.254789 0.230401 0.230552
chargesum: 0.00000
title: Mulliken charges with hydrogens summed into heavy atoms:
elementType: O O N N C C C C C C C C C C C C C C C C
charge: -0.289488 -0.311367 -0.131776 -0.137236 -0.178460 -0.161092 0.038971 -0.026450 0.412486 0.030916 0.015128 0.200541 0.261638 0.127517 -0.131972 -0.104257 0.097017 0.093743 0.106924 0.087219
polarizability: 2.14833095e+02 -3.59954389e+00 1.94815559e+02 -7.72891175e+00 1.04366781e+01 1.63510699e+02
1716.lowfreq: -7.8067 -5.2555 -0.0005 -0.0003 0.0006 5.6149 17.4735 42.5478 51.5037
frequency: 16.9066 42.5387 51.4702 61.6357 75.9764 79.3061 85.3058 111.6791 118.1248 123.6975 136.7635 142.8344 145.5711 166.1384 174.1074 186.0233 214.7168 241.7140 255.2200 269.7639 273.5732 292.0220 326.9430 364.0809 383.9739 392.4250 410.1411 417.8897 443.6345 457.4074 529.8192 546.2187 561.5443 604.4506 643.1406 672.5662 694.7261 715.4801 741.6160 781.4612 815.6125 834.0195 855.9063 872.9188 908.0560 916.0399 936.3779 941.7173 950.2265 961.1959 973.1210 975.6670 994.2892 1008.1376 1048.9366 1055.6641 1080.8748 1088.9939 1092.3947 1094.7973 1099.4314 1109.1139 1132.0142 1135.1701 1143.0180 1145.5299 1158.4030 1161.8358 1200.2015 1209.6009 1231.0645 1235.2366 1245.1952 1249.1825 1260.9631 1304.2164 1307.0546 1327.2342 1385.1110 1385.3273 1392.5896 1398.5404 1404.8080 1408.1795 1442.7937 1450.5279 1453.8283 1462.0128 1469.1819 1471.8679 1474.5524 1475.0808 1477.2929 1484.6308 1489.4049 1500.1672 1503.0330 1506.0694 1566.8558 1568.6931 1578.6240 1753.0885 2952.3490 2957.3046 2960.6569 2964.5272 2965.0898 2968.5361 3014.1375 3024.3453 3026.4547 3029.7528 3033.2435 3036.6736 3041.2229 3055.7214 3079.3254 3090.6590 3108.4060 3112.5122 3117.0293 3122.1769 3122.3766 3130.1772 3158.4623 3191.1112
redmass: 4.0514 3.3903 1.9266 3.4033 2.0458 2.5851 2.0571 1.8833 1.4879 1.4633 1.1683 2.3397 1.5640 1.5779 1.8487 2.5464 3.2592 4.1051 2.5185 2.3660 2.9385 3.7097 3.7924 3.1575 3.5364 3.0520 2.5671 2.8829 3.0654 3.4326 3.5228 3.6911 4.8545 4.7141 5.8550 2.5061 7.0243 5.0970 2.9804 5.3898 5.1660 4.0895 3.9627 3.0109 2.4196 1.4238 3.7118 2.5740 1.5175 2.5248 1.8739 1.7121 2.4362 2.4406 1.3765 1.3987 1.6391 1.3117 1.2268 1.2223 1.5859 3.4324 1.6559 1.8821 1.4060 1.3843 1.3359 1.3057 1.5116 1.4841 5.2927 4.0474 2.8583 2.1008 1.5529 1.5489 1.7357 1.5760 2.6635 1.2579 2.3554 1.2151 1.2439 1.1952 1.1902 1.0571 1.1246 1.0502 1.0477 1.0506 1.0697 1.0667 1.0959 1.0591 1.0487 1.1285 1.1801 1.1614 5.3065 5.4879 5.7510 8.4974 1.0381 1.0377 1.0393 1.0369 1.0388 1.0369 1.0841 1.0990 1.0971 1.0994 1.0966 1.1013 1.1016 1.0848 1.0965 1.0901 1.0980 1.0953 1.0968 1.0906 1.0967 1.0943 1.0874 1.1097
irintensity: 4.3509 0.3240 1.8608 0.5918 0.8900 1.5948 3.0222 0.6362 0.1697 0.7632 0.6163 3.8880 1.0116 3.1743 0.7705 0.6379 0.1482 0.1875 5.4076 2.7709 4.1330 1.9745 9.3474 8.5424 21.1193 9.9498 1.6897 1.0727 0.6021 3.4256 5.9265 2.7803 7.6797 2.3281 9.0468 23.0626 0.3740 2.2525 45.1500 2.5007 9.3588 9.4945 2.9592 6.3380 3.2810 4.1869 7.7466 1.9430 2.5257 2.4733 4.9789 4.2117 15.4088 21.3079 3.7321 5.2010 2.0504 13.5281 0.1512 0.9893 6.0582 41.7040 110.3685 140.6170 4.7577 6.0237 1.1345 45.1565 3.0931 11.1495 24.3248 16.3951 9.9572 36.0488 2.9232 0.2064 11.3219 12.6893 89.9959 28.2029 74.4170 11.8414 56.4582 46.9025 10.2246 3.7447 8.6621 10.7369 28.6407 5.8909 5.0740 8.9951 13.4200 10.2109 24.3103 16.0996 37.3742 25.6084 218.5567 226.2945 17.9148 0.1553 72.0998 35.8656 39.0847 137.7582 75.0113 95.0908 10.7824 37.7845 14.8690 40.8376 38.7604 34.6104 30.6612 6.5421 24.8669 44.2395 11.2134 17.8113 2.3666 17.3127 1.8813 16.3200 6.8118 20.7028
temp: 298.150 k
press: 1.00000 atm
elementType: 8 8 7 7 6 6 6 6 6 6 6 6 6 6 6 6 6 6 6 6 1 1 1 1 1 1 1 1 1 1 1 1 1 1 1 1 1 1 1 1 1 1 1 1
symmnumber: 1
zpe: 973619.9 jmol-1
zpe.correction: 0.370832 hartree
zpe.thermalcorrener: 0.393327 hartree
zpe.thermalcorrenthalpy: 0.394272 hartree
zpe.thermalcorrgfe: 0.318471 hartree
zpe.sumelectzpe: -882.473480 hartree
zpe.sumelectthermal: -882.450984 hartree
zpe.sumelectthermalent: -882.450040 hartree
zpe.sumelectthermalfe: -882.525841 hartree
dipole: -3.0473 -1.3838 -2.2340
dipole: 4.0239
quadrupole: -120.6717 -107.7855 -118.2170
quadrupole: 1.1918 9.2313 5.5772
quadrupole: -5.1137 7.7726 -2.6589 1.1918 9.2313 5.5772
hfenergy: -882.8443117 hartree
pointgroup: C01 [X(C16H24N2O2)]
dipole: 1.1740104 0.5056165 -0.933981 debye
polarizability: 214.7643758|-0.0724692|190.6995564|10.1485429|-13.9200411|167.6954214 unknown
InChI: InChI=1S/C16H24N2O2/c1-9(2)12-10-7-8-11(12)14(16(20)18(5)6)13(10)15(19)17(3)4/h7-8,10-11,13-14H,1-6H3
charge 0 multiplicity 1
44 atoms
O  -1.508131 -2.259047 -0.482599
O  2.617764 0.230671 1.085493
N  0.581955 -3.068792 0.13118
N  2.723515 1.393275 -0.919007
C  -1.393957 0.01175 1.258123
C  -0.410595 1.61988 -0.021503
C  -0.066877 -0.716228 0.757935
C  0.547466 0.344875 -0.234705
C  -1.748436 0.86927 0.034084
C  -0.880628 1.104015 2.206444
C  -0.275521 2.059775 1.441143
C  -0.383169 -2.062743 0.088814
C  2.031062 0.639648 0.026619
C  -2.849058 0.92789 -0.754292
C  -2.969708 1.888831 -1.927038
C  -4.049487 0.022608 -0.545447
C  0.261164 -4.378214 -0.46536
C  1.903741 -2.985133 0.777638
C  4.12974 1.750704 -0.656499
C  2.173894 1.908052 -2.181883
H  -2.151851 -0.677696 1.649477
H  -0.276726 2.402097 -0.781755
H  0.624106 -0.840255 1.606993
H  0.397329 -0.001523 -1.273952
H  -0.905863 1.043338 3.297485
H  0.284477 2.933537 1.783078
H  -3.113804 1.331985 -2.874691
H  -3.856888 2.542312 -1.806596
H  -2.085552 2.538787 -2.04043
H  -4.961892 0.614651 -0.330174
H  -4.248454 -0.562811 -1.464473
H  -3.888762 -0.699138 0.269042
H  -0.755377 -4.329384 -0.883511
H  0.306873 -5.174464 0.303269
H  0.981269 -4.626008 -1.269165
H  2.677362 -3.363799 0.081428
H  1.933702 -3.613819 1.690916
H  2.171224 -1.95297 1.046284
H  4.41381 1.33752 0.322468
H  4.254124 2.850799 -0.643173
H  4.790508 1.330726 -1.439451
H  1.193832 1.466142 -2.40578
H  2.860191 1.660114 -3.014391
H  2.062133 3.010572 -2.149537
