program: Gaussian 09
title: 000299872
version: EM64L-G09RevD.01
frameworkgroup: C1[X(C10H16N6O2)]
method: RPBEPBE
basis: SDD
operation: Freq
keyword: #p
keyword: freq=noraman
keyword: PBEPBE/SDD
title: #p freq=noraman PBEPBE/SDD
converged: YES YES NO NO
title: Mulliken charges:
elementType: O O N N N N N N C C C C C C C C C C H H H H H H H H H H H H H H H H
charge: -0.273286 -0.313264 -0.197543 -0.060961 -0.192559 -0.644213 0.017708 -0.041496 -0.043689 -0.443900 -0.472282 -0.304776 0.138117 -0.188600 -0.076011 0.162218 -0.598141 -0.623881 0.293301 0.232742 0.268716 0.235868 0.240005 0.222005 0.218336 0.279783 0.381361 0.314120 0.274947 0.230276 0.231411 0.227948 0.252384 0.253358
chargesum: 0.00000
title: Mulliken charges with hydrogens summed into heavy atoms:
elementType: O O N N N N N N C C C C C C C C C C
charge: -0.273286 -0.313264 -0.197543 -0.060961 -0.192559 0.051268 0.017708 -0.041496 0.249612 0.057558 0.003591 0.135564 0.138117 0.091182 -0.076011 0.162218 0.138494 0.109808
polarizability: 2.80381850e+02 -9.48443259e+00 1.60920410e+02 7.06007239e+00 1.57899869e+00 9.40677678e+01
1716.lowfreq: -12.3837 -7.9455 -0.0010 -0.0009 -0.0007 3.0585 34.2641 35.4633 54.4543
frequency: 34.0728 35.3575 54.3043 64.4375 82.7277 88.9334 97.4348 140.6944 156.7788 169.8875 173.5367 211.9575 218.7119 232.3345 246.7614 296.6090 334.2519 364.1989 381.5155 397.0053 424.7602 435.8302 539.8295 542.7970 580.2228 613.9233 629.1329 655.1424 678.9788 689.9807 745.8726 756.1662 784.9745 794.3611 821.7016 836.1793 868.0814 880.8841 892.8209 917.0323 935.7865 993.5659 1023.5331 1036.2368 1042.7234 1058.6069 1085.0483 1090.4470 1099.9561 1121.4371 1128.4256 1149.4994 1154.6816 1187.6457 1211.9066 1240.6125 1261.5201 1276.1148 1285.5946 1299.0114 1304.3356 1314.7309 1336.9082 1337.9033 1360.6921 1371.4969 1401.0261 1417.0758 1440.7199 1448.3159 1449.9613 1459.4140 1470.7991 1471.6123 1482.2837 1484.1409 1491.7191 1494.0848 1582.9405 1597.0296 2969.1530 2975.3230 3000.1605 3019.7827 3034.8773 3047.0843 3047.7231 3067.7658 3092.4933 3108.0809 3115.8670 3124.0881 3126.4981 3262.9936 3283.4715 3628.8353
redmass: 3.2318 4.0430 3.5281 3.4236 4.1071 4.1277 1.9766 2.9966 2.7605 3.3596 1.4181 2.3102 3.8796 2.2794 4.5877 6.1756 4.6306 4.3672 7.2670 5.8700 3.5620 3.5774 1.3026 3.6503 2.2558 3.9278 4.2084 4.7272 4.8406 8.0329 5.2381 5.6170 5.9095 1.1297 1.4828 2.5891 2.1633 2.0783 3.6453 2.6670 2.4770 4.6019 3.9593 1.5007 2.0906 2.0645 1.2463 2.4824 2.1217 1.8912 1.3415 1.2998 1.6715 1.6121 1.3732 1.4608 5.4433 2.7723 4.0396 1.4560 4.5385 1.2798 3.9165 1.3372 4.5935 2.0677 2.5834 1.1553 1.3186 1.0467 4.2665 1.1165 1.0931 1.0460 1.9600 1.2112 1.1006 1.6765 1.9398 2.4182 1.0349 1.0357 1.0597 1.0638 1.0661 1.1018 1.1005 1.1045 1.1035 1.0897 1.0995 1.1011 1.0977 1.0978 1.0629 1.0902
irintensity: 0.7954 3.4770 1.7517 2.7162 0.2036 2.6973 4.4142 4.3357 1.4251 4.0600 3.9167 2.1385 10.4135 1.4516 2.1299 12.0146 5.5028 7.8172 0.1040 4.4327 11.8526 0.5876 108.2035 19.0833 10.5119 49.0140 26.4617 5.9222 2.4496 16.6130 28.8322 5.8535 3.8913 68.7654 27.1885 23.9143 8.4427 19.1422 16.3150 16.3832 26.5424 13.8375 168.2203 23.0533 79.6939 67.7357 0.0480 39.6036 4.6635 2.2539 0.5237 20.0162 9.1166 63.6094 62.1483 5.3155 13.8553 13.2764 28.5561 13.3373 6.9109 3.8601 30.7708 2.2771 422.0059 95.9567 77.5338 25.7058 62.7389 20.1390 39.3150 6.2681 13.5844 13.0351 55.5853 3.4541 13.3154 55.2989 288.4404 261.7264 52.1855 93.6444 85.7089 18.0141 14.1268 23.9712 33.5753 21.8356 42.4596 4.9893 15.9340 23.5524 7.4812 0.2594 213.2963 74.4104
temp: 298.150 k
press: 1.00000 atm
elementType: 8 8 7 7 7 7 7 7 6 6 6 6 6 6 6 6 6 6 1 1 1 1 1 1 1 1 1 1 1 1 1 1 1 1
symmnumber: 1
zpe: 712818.4 jmol-1
zpe.correction: 0.271498 hartree
zpe.thermalcorrener: 0.289444 hartree
zpe.thermalcorrenthalpy: 0.290388 hartree
zpe.thermalcorrgfe: 0.224231 hartree
zpe.sumelectzpe: -868.206959 hartree
zpe.sumelectthermal: -868.189014 hartree
zpe.sumelectthermalent: -868.188070 hartree
zpe.sumelectthermalfe: -868.254226 hartree
dipole: 3.6821 0.2750 2.6287
dipole: 4.5325
quadrupole: -63.1000 -110.9674 -108.6464
quadrupole: 11.0700 -5.6497 -1.4078
quadrupole: 31.1379 -16.7295 -14.4085 11.0700 -5.6497 -1.4078
hfenergy: -868.4784574 hartree
pointgroup: C01 [X(C10H16N6O2)]
dipole: 1.4510249 0.0430027 1.0356463 debye
polarizability: 280.2444718|-10.7696178|160.7390045|6.238396|5.0036293|94.3865513 unknown
InChI: InChI=1S/C10H16N6O2/c1-15(2)14-13-10-8(9(11)17)16(6-12-10)7-4-3-5-18-7/h6-7H,3-5,11H2,1-2H3
charge 0 multiplicity 1
34 atoms
O  -3.633223 -0.786955 -1.072393
O  -1.290378 2.738226 -0.152352
N  -1.392709 -0.208125 -0.458642
N  0.344929 -1.68356 -0.449742
N  2.173173 0.003802 -0.071761
N  1.034651 2.569513 0.06267
N  3.043118 -0.988756 -0.075783
N  4.32687 -0.577851 0.09025
C  -2.805963 0.292067 -0.539854
C  -3.388282 0.632925 0.849834
C  -3.941024 -0.730184 1.334644
C  -4.482107 -1.346966 0.028747
C  -0.230992 0.557415 -0.251201
C  -0.99211 -1.532549 -0.57416
C  0.831685 -0.386654 -0.248383
C  -0.22373 2.030104 -0.111873
C  5.335751 -1.641727 0.083891
C  4.701645 0.836127 0.24743
H  -2.816978 1.144147 -1.233083
H  -4.203863 1.365126 0.714379
H  -2.635101 1.081378 1.512756
H  -3.128368 -1.349308 1.754801
H  -4.725714 -0.620165 2.101325
H  -4.40173 -2.446771 -0.017489
H  -5.527904 -1.046455 -0.170434
H  -1.698171 -2.329847 -0.78367
H  1.846772 1.92908 0.07775
H  1.117267 3.580405 0.152488
H  4.807976 -2.598678 -0.042088
H  5.9007 -1.659347 1.034961
H  6.050596 -1.508527 -0.750279
H  5.795017 0.901286 0.359597
H  4.210854 1.272739 1.137911
H  4.383542 1.423785 -0.634747
