program: Gaussian 09
title: 000299947
version: EM64L-G09RevD.01
frameworkgroup: C1[X(C25H21BrClNOS)]
method: RPBEPBE
basis: SDD
operation: Freq
keyword: #p
keyword: freq=noraman
keyword: PBEPBE/SDD
title: #p freq=noraman PBEPBE/SDD
converged: YES YES NO NO
title: Mulliken charges:
elementType: Br Cl S O N C C C C C C C C C C C C C C C C C C C C C C C C C H H H H H H H H H H H H H H H H H H H H H
charge: -0.000329 -0.067377 0.273402 -0.264437 -0.097406 -0.376972 -0.488722 -0.526688 -0.537987 0.277142 0.264138 0.467643 0.425897 -0.361068 -0.383960 -0.387520 -0.386864 -0.438456 -0.247134 -0.244978 -0.345912 -0.275233 -0.232994 -0.208545 0.369653 -0.319648 -0.360640 -0.211285 -0.188859 -0.115539 0.218513 0.197489 0.200937 0.251637 0.210256 0.242120 0.228102 0.216089 0.234654 0.232960 0.276583 0.232557 0.228963 0.228373 0.253514 0.252308 0.254517 0.262852 0.259072 0.252787 0.256393
chargesum: 0.00000
title: Mulliken charges with hydrogens summed into heavy atoms:
elementType: Br Cl S O N C C C C C C C C C C C C C C C C C C C C C C C C C
charge: -0.000329 -0.067377 0.273402 -0.264437 -0.097406 0.039031 -0.036148 -0.074312 -0.093796 0.277142 0.264138 0.467643 0.425897 -0.361068 -0.149305 -0.154559 -0.386864 0.070684 -0.018171 -0.016605 -0.092399 -0.022926 -0.232994 0.045971 0.369653 -0.056795 -0.101568 0.041502 0.067534 -0.115539
polarizability: 4.68797159e+02 2.61947041e+01 3.09748462e+02 -6.54701358e+00 -1.36275600e+01 2.18466687e+02
1716.lowfreq: -6.0633 -3.9512 -0.0024 0.0003 0.0011 3.4270 6.6008 10.9615 19.2496
frequency: -5.5531 10.0117 19.1526 21.3587 34.6933 35.8208 58.3063 76.1545 87.2079 109.5024 118.9681 130.9717 137.6661 148.9452 153.4006 197.2224 219.6040 237.1801 248.9883 257.5753 282.4813 283.6368 301.7971 316.2132 327.6897 335.5444 376.3613 386.9081 413.3541 416.0028 426.3295 429.4912 439.2883 455.0617 476.6286 499.1807 502.2954 515.6011 532.4030 551.8554 578.4200 594.1255 622.7726 628.0861 635.0265 662.8588 688.7044 696.4407 706.5196 712.4386 731.7166 738.1706 751.3620 793.0197 798.0052 802.0853 805.3462 824.2505 831.4485 863.5584 868.9412 883.0191 924.2920 926.9272 940.4889 945.9403 949.7322 951.4251 954.4705 983.1916 986.5889 990.4327 990.9228 1022.4087 1037.3863 1039.8308 1055.3453 1060.5335 1062.4711 1071.4893 1090.8443 1109.6229 1129.2884 1138.7355 1149.4293 1172.7223 1174.4449 1183.1957 1192.0289 1200.8089 1209.4759 1214.0064 1217.4451 1234.3091 1242.5637 1255.8681 1266.3500 1288.8330 1291.7589 1314.0684 1328.8576 1342.5669 1346.4804 1357.6745 1372.5010 1382.6125 1386.5948 1392.8286 1404.6357 1413.4951 1442.3794 1444.0096 1447.7130 1459.6115 1464.3736 1471.0293 1476.9133 1484.9986 1492.7516 1543.7251 1580.1790 1584.0413 1593.8426 1596.3512 1603.7782 1617.4438 2811.0070 2859.2627 2874.4157 2957.0042 2976.4534 3002.6886 3023.9365 3030.9395 3035.1319 3039.9892 3112.0562 3116.0626 3137.9200 3152.5582 3154.7454 3159.2643 3160.2442 3161.6520 3174.1511 3178.3582 3179.5154
redmass: 6.0994 7.8941 6.6087 8.4032 5.0244 4.7596 6.4863 5.5232 6.2226 4.4174 8.0134 6.9082 8.4635 4.6337 3.5552 3.1900 4.5268 7.5516 5.0125 2.7252 3.3739 6.9386 3.9835 6.7261 3.9672 2.9037 7.7041 3.2035 4.6283 3.4150 3.1326 2.6523 4.5584 4.8733 4.3345 2.7317 3.6573 5.3383 8.7393 6.3067 4.3753 4.9408 7.0753 4.3529 5.7924 4.8976 5.3846 3.5803 5.6808 3.5454 3.8629 3.6785 1.3769 5.5246 2.4307 1.3570 1.3463 1.5344 4.1113 2.9559 1.4391 1.7386 2.3680 1.3774 1.3998 6.6560 1.4078 1.6753 1.4822 2.4682 1.4060 1.8157 3.9155 2.9943 2.5396 2.4709 2.8908 2.4627 1.8896 2.5694 2.8713 1.3080 1.8170 2.6844 1.4169 1.3208 1.0602 1.6533 1.2978 2.1259 1.3327 3.2052 1.5950 1.5396 1.4819 1.3099 1.5218 1.4545 1.2983 1.8535 1.6095 1.4511 1.4385 1.7471 5.2285 3.0515 4.3744 2.2173 3.7351 3.0581 2.7027 2.7916 1.1213 1.1109 1.2380 1.4527 1.3365 1.1204 2.4341 7.1380 7.7666 7.3930 8.1949 6.8101 6.7707 6.4882 1.0712 1.0708 1.0695 1.0620 1.0615 1.0877 1.0849 1.0898 1.0988 1.0989 1.0868 1.0895 1.0926 1.0894 1.0881 1.0884 1.1004 1.0917 1.0967 1.0966 1.0978
irintensity: 0.3180 0.0984 0.1497 0.1370 0.2408 0.1317 0.3170 0.3156 0.8725 1.0865 0.4184 0.4641 2.7318 1.4102 1.0024 2.3629 0.9302 0.9514 1.6821 10.9808 1.1912 0.3972 2.3253 1.4532 0.7400 3.4470 5.9945 7.8863 0.2622 0.3849 7.6820 6.5383 1.8775 1.8584 2.0190 20.6469 0.5282 8.5742 5.3421 13.0630 3.9824 14.4904 1.8197 3.0771 15.7668 17.8851 22.3919 2.1238 9.7366 2.6681 11.2656 14.7029 54.8689 6.4541 5.6451 12.7632 39.7611 68.1986 3.3083 17.3622 4.5975 13.4616 27.2184 2.3494 0.3882 153.8075 6.1518 19.1081 3.6020 25.1010 2.1363 2.4634 36.7408 47.9257 5.4748 1.2085 16.9100 24.9417 5.6843 42.0182 48.3700 12.2515 13.6970 9.2861 6.8999 65.7474 0.8795 17.6351 12.8969 1.1704 52.1262 333.9589 30.5372 7.3251 10.1981 5.6520 2.0212 4.6863 0.9711 22.8337 2.7759 46.0901 3.4087 10.5104 34.3636 0.2521 1.1890 3.0488 0.2144 40.4770 4.6660 25.4743 11.2097 5.4570 91.5847 145.0163 57.2179 17.3746 18.8184 13.9038 24.0384 15.8471 25.2715 3.3849 28.4225 0.7349 56.3765 53.2270 137.7333 15.7541 25.6601 16.7497 21.3047 37.6483 42.3327 6.1285 14.4461 2.1417 25.4919 2.1333 12.7762 2.2409 33.5909 2.0386 6.3755 4.2254 1.0301
temp: 298.150 k
press: 1.00000 atm
elementType: 35 17 16 8 7 6 6 6 6 6 6 6 6 6 6 6 6 6 6 6 6 6 6 6 6 6 6 6 6 6 1 1 1 1 1 1 1 1 1 1 1 1 1 1 1 1 1 1 1 1 1
symmnumber: 1
zpe: 1023319.1 jmol-1
zpe.correction: 0.389762 hartree
zpe.thermalcorrener: 0.415576 hartree
zpe.thermalcorrenthalpy: 0.416520 hartree
zpe.thermalcorrgfe: 0.329780 hartree
zpe.sumelectzpe: -1964.692359 hartree
zpe.sumelectthermal: -1964.666545 hartree
zpe.sumelectthermalent: -1964.665601 hartree
zpe.sumelectthermalfe: -1964.752340 hartree
dipole: -1.4391 2.0957 -0.3525
dipole: 2.5666
quadrupole: -232.3430 -187.1576 -192.7748
quadrupole: 7.9954 -5.8839 -6.1325
quadrupole: -28.2512 16.9342 11.3170 7.9954 -5.8839 -6.1325
hfenergy: -1965.0821209 hartree
pointgroup: C01 [X(C25H21Br1Cl1N1O1S1)]
dipole: 0.1378258 0.9461673 0.3246734 debye
polarizability: 454.5492786|54.0209689|315.1462915|-16.9506045|25.0573819|227.3167384 unknown
InChI: InChI=1S/C25H21BrClNOS/c26-19-5-10-24-22(13-19)23(15-28-12-11-17-3-1-2-4-18(17)14-28)25(30-24)16-29-21-8-6-20(27)7-9-21/h1-10,13H,11-12,14-16H2
charge 0 multiplicity 1
51 atoms
Br 6.925491 1.391348 0.558781
Cl -6.234301 -5.347793 -0.403832
S  1.834741 -1.814547 -2.016339
O  -0.71161 -2.922418 -0.497873
N  0.069202 1.175814 1.314271
C  -0.5449 1.632903 2.588956
C  0.471722 2.332926 0.476368
C  1.203584 0.239947 1.542609
C  -1.885164 2.33029 2.294436
C  -0.638486 3.3637 0.322324
C  -1.750026 3.386874 1.205344
C  1.720592 -0.391154 0.260862
C  3.09567 -0.273186 -0.212834
C  0.932988 -1.163105 -0.576522
C  -0.538396 4.33965 -0.69991
C  -2.737914 4.391405 1.045775
C  3.330275 -0.984389 -1.433627
C  -0.528618 -1.451843 -0.45329
C  -1.526303 5.334591 -0.853666
C  -2.634132 5.361243 0.026408
C  4.178681 0.434698 0.379948
C  4.594007 -1.009034 -2.055517
C  5.428942 0.409158 -0.254334
C  5.658869 -0.300472 -1.460617
C  -2.031491 -3.401679 -0.470794
C  -3.183827 -2.584803 -0.348231
C  -2.162986 -4.810033 -0.571282
C  -4.465846 -3.18295 -0.328239
C  -3.438893 -5.404759 -0.550407
C  -4.577407 -4.579872 -0.429458
H  -0.709801 0.75054 3.234817
H  0.135794 2.329635 3.141399
H  1.373557 2.839622 0.915382
H  0.777804 1.95748 -0.517084
H  2.049408 0.749125 2.067751
H  0.840501 -0.551349 2.226866
H  -2.618129 1.564325 1.971826
H  -2.282495 2.785087 3.222194
H  0.321355 4.317829 -1.381774
H  -3.594979 4.410932 1.730957
H  -0.910553 -1.025669 0.492541
H  -1.09884 -0.996253 -1.290151
H  -1.435864 6.080889 -1.650594
H  -3.406332 6.131054 -0.081386
H  4.042456 0.985609 1.314614
H  4.759983 -1.561992 -2.985096
H  6.649324 -0.299091 -1.92328
H  -3.10851 -1.497058 -0.265714
H  -1.259318 -5.419054 -0.665713
H  -5.360958 -2.561267 -0.235144
H  -3.545464 -6.490501 -0.628216
