program: Gaussian 09
title: 000299856
version: EM64L-G09RevD.01
frameworkgroup: C1[X(C16H17NO5)]
method: RPBEPBE
basis: SDD
operation: Freq
keyword: #p
keyword: freq=noraman
keyword: PBEPBE/SDD
title: #p freq=noraman PBEPBE/SDD
converged: YES YES NO NO
title: Mulliken charges:
elementType: O O O O O N C C C C C C C C C C C C C C C C H H H H H H H H H H H H H H H H H
charge: -0.284631 -0.284624 -0.265876 -0.273573 -0.273572 -0.305946 -0.370560 0.561407 0.279843 0.279816 -0.364292 -0.364297 -0.411480 -0.394217 0.097738 0.097740 -0.362154 -0.349553 0.309217 -0.498123 -0.498121 -0.538535 0.273836 0.291725 0.291722 0.231861 0.225695 0.314983 0.245972 0.235288 0.228277 0.242419 0.238985 0.238978 0.242420 0.228282 0.219930 0.219927 0.243491
chargesum: 0.00000
title: Mulliken charges with hydrogens summed into heavy atoms:
elementType: O O O O O N C C C C C C C C C C C C C C C C
charge: -0.284631 -0.284624 -0.265876 -0.273573 -0.273572 0.009038 -0.096723 0.561407 0.279843 0.279816 -0.072567 -0.072575 -0.179619 -0.168522 0.097738 0.097740 -0.116181 -0.114265 0.309217 0.211558 0.211559 0.144813
polarizability: 2.19742732e+02 -9.22066702e-04 2.04978718e+02 2.35084936e+01 -1.12702386e-02 1.96141439e+02
1716.lowfreq: -13.8923 -3.4306 -0.0002 0.0004 0.0006 3.9615 7.2579 28.2293 32.1280
frequency: -12.8442 28.2286 32.1108 54.4639 63.7292 82.8974 87.3341 94.1153 96.8276 97.5751 132.3073 151.6702 152.5795 181.7633 191.5340 230.7767 249.0961 261.0383 281.2702 309.1369 324.1669 337.1874 358.0338 362.4635 408.8664 428.0365 464.5197 476.3991 491.6555 511.1067 544.1018 565.5691 578.6941 628.2489 656.6245 679.0016 690.3078 715.3481 738.1481 745.5535 767.4162 799.8550 816.8903 836.1882 847.0148 911.5738 913.7638 914.3702 928.4183 942.4864 960.8115 961.1379 989.4006 1003.9388 1041.4836 1043.2020 1091.3461 1110.2687 1113.2649 1113.4656 1113.5554 1144.2591 1148.6143 1155.9358 1175.1758 1184.7111 1191.8814 1227.3962 1249.1948 1264.4641 1278.7509 1293.7253 1314.5819 1348.4477 1352.0892 1392.5005 1418.1954 1422.6959 1423.3036 1437.2902 1450.1762 1450.3570 1464.2657 1464.5741 1466.6246 1473.1176 1481.4570 1497.8034 1585.2658 1585.7241 1601.1644 1619.3521 1630.6283 1671.2937 2957.1504 3001.2704 3001.4393 3039.1937 3043.5538 3101.8729 3101.9592 3122.3854 3125.8370 3135.8173 3144.2518 3144.3350 3157.3080 3164.9089 3171.0007 3173.3958 3589.3327
redmass: 3.5207 4.6973 5.1456 4.7898 5.0658 4.4759 2.8284 4.1476 1.2205 1.1810 4.0971 4.1877 4.1093 3.5050 5.2609 1.6058 2.3994 3.7206 4.2583 4.6297 8.4499 7.0278 5.5451 5.4069 2.8871 6.5303 4.5400 4.4870 3.5027 3.6488 1.8242 3.6597 2.2505 6.1754 5.4542 6.1063 7.7959 5.9541 4.0075 5.9638 5.4932 1.6567 1.7921 5.5721 2.6121 3.7462 1.7808 1.4341 2.1168 2.1982 5.1816 1.4451 8.5522 2.6499 4.1398 4.3515 3.1174 1.3411 1.2598 1.2646 1.2647 1.5111 1.4914 1.3502 1.2831 1.9367 2.7109 3.3524 1.2668 1.6425 3.9690 2.2461 1.4328 1.7711 2.2323 3.9157 2.9683 1.2066 1.2053 1.1737 1.0502 1.0503 1.0581 1.0530 1.0499 1.0775 2.1536 2.3909 7.7783 6.9816 10.1187 6.3846 5.2076 6.8886 1.0331 1.0295 1.0295 1.0842 1.1038 1.1043 1.1043 1.0982 1.0890 1.0888 1.1046 1.1045 1.0941 1.0962 1.0929 1.0955 1.0788
irintensity: 0.4098 0.0196 0.2539 0.0287 3.3511 0.8326 2.6973 7.2846 0.6068 0.5339 1.8087 0.0021 14.0619 5.1391 0.2664 0.0565 0.6921 8.3432 13.5927 6.4773 8.0251 4.5786 0.2484 0.0403 0.0000 0.1475 12.2248 12.1359 23.2817 0.3454 108.2203 9.4176 6.7612 0.6682 7.4244 10.5972 44.2347 0.0338 0.3540 11.3801 2.2687 31.8548 10.7546 16.1622 20.7216 15.1916 41.2409 0.4099 0.1776 3.1248 1.9752 3.2706 40.6767 6.1561 258.4843 154.5197 28.0108 19.5566 0.1091 0.0018 0.1968 120.8822 48.0579 0.2178 86.7891 247.6395 0.0238 189.6433 31.1651 47.5476 198.1198 0.7418 0.8888 10.7925 2.0545 10.0758 1.3918 65.6864 16.7263 11.2700 0.0704 24.7847 2.8780 19.9116 13.6208 60.3458 288.3479 92.1692 673.6612 16.0770 46.3808 69.4283 5.6781 103.2882 70.9298 53.5288 32.0360 4.4917 48.8972 0.3138 52.6304 35.1896 3.2789 10.3591 2.8994 25.4903 16.5392 6.8095 0.0257 0.5102 85.0253
temp: 298.150 k
press: 1.00000 atm
elementType: 8 8 8 8 8 7 6 6 6 6 6 6 6 6 6 6 6 6 6 6 6 6 1 1 1 1 1 1 1 1 1 1 1 1 1 1 1 1 1
symmnumber: 1
zpe: 793975.7 jmol-1
zpe.correction: 0.302409 hartree
zpe.thermalcorrener: 0.323450 hartree
zpe.thermalcorrenthalpy: 0.324394 hartree
zpe.thermalcorrgfe: 0.251358 hartree
zpe.sumelectzpe: -1049.139356 hartree
zpe.sumelectthermal: -1049.118315 hartree
zpe.sumelectthermalent: -1049.117371 hartree
zpe.sumelectthermalfe: -1049.190407 hartree
dipole: 0.4116 0.0005 -1.7162
dipole: 1.7649
quadrupole: -116.9920 -141.2912 -101.3858
quadrupole: 0.0004 -0.6301 -0.0044
quadrupole: 2.8976 -21.4015 18.5039 0.0004 -0.6301 -0.0044
hfenergy: -1049.4417653 hartree
pointgroup: C01 [X(C16H17N1O5)]
dipole: 0.0609973 0.0000699 -0.6916797 debye
polarizability: 226.0643539|0.0342484|204.9787655|19.0653088|0.0125163|189.8197703 unknown
InChI: InChI=1S/C16H17NO5/c1-20-11-6-4-10(5-7-11)14-12(15(18)21-2)8-17-9-13(14)16(19)22-3/h4-9,14,17H,1-3H3
charge 0 multiplicity 1
39 atoms
O  -0.773157 -2.486715 1.627681
O  -0.779384 2.48521 1.626189
O  4.687787 0.005641 -0.660134
O  -1.891349 -3.687775 -0.033088
O  -1.900839 3.682516 -0.035095
N  -2.825547 -0.004369 -1.915313
C  -1.007596 -0.001361 0.381842
C  0.502683 0.000533 0.069981
C  -1.689829 -1.254152 -0.187926
C  -1.693125 1.249323 -0.188605
C  -2.483828 -1.211914 -1.308623
C  -2.487019 1.204398 -1.309267
C  1.458533 0.001797 1.118175
C  0.973176 0.000996 -1.263541
C  -1.485305 -2.582975 0.422019
C  -1.491999 2.578997 0.420615
C  2.837737 0.003467 0.846323
C  2.355375 0.002679 -1.560063
C  3.291441 0.003922 -0.496843
C  -0.514198 -3.77269 2.310622
C  -0.52349 3.772215 2.308342
C  5.206489 0.00634 -2.028916
H  -1.107948 -0.00119 1.480767
H  -2.899272 -2.128803 -1.735781
H  -2.904875 2.119955 -1.736929
H  1.109443 0.001447 2.15652
H  0.255493 0.000041 -2.092795
H  -3.428423 -0.005386 -2.736235
H  3.581074 0.004451 1.649593
H  2.684282 0.002996 -2.603781
H  0.037322 -3.501273 3.221924
H  0.088102 -4.433109 1.664222
H  -1.46444 -4.277685 2.55444
H  -1.474941 4.274889 2.552252
H  0.076859 4.433841 1.661362
H  0.029068 3.502714 3.219582
H  4.884965 0.910453 -2.582426
H  4.887319 -0.898581 -2.58247
H  6.301319 0.007761 -1.92202
