program: Gaussian 09
title: 000299833
version: EM64L-G09RevD.01
frameworkgroup: C1[X(C8H12O4)]
method: RPBEPBE
basis: SDD
operation: Freq
keyword: #pfreq=noraman
keyword: PBEPBE/SDD
title: #p freq=noraman PBEPBE/SDD
converged: YES YES NO NO
title: Mulliken charges:
elementType: O O O O C C C C C C C C H H H H H H H H H H H H
charge: -0.237377 -0.200822 -0.263447 -0.242315 -0.036671 -0.462897 -0.413532 -0.550300 -0.482360 0.200535 0.236508 -0.504971 0.240889 0.243442 0.233531 0.242712 0.222443 0.268589 0.260590 0.241863 0.284526 0.240724 0.235430 0.242909
chargesum: 0.00000
title: Mulliken charges with hydrogens summed into heavy atoms:
elementType: O O O O C C C C C C C C
charge: -0.237377 -0.200822 -0.263447 -0.242315 0.204218 0.014076 0.051623 -0.021121 0.044030 0.200535 0.236508 0.214093
polarizability: 1.16335370e+02 8.33637056e-01 8.84074138e+01 6.13109949e+00 -5.39930800e-01 8.06893249e+01
1716.lowfreq: -14.0540 -0.0008 -0.0007 -0.0006 1.2801 9.6878 21.6725 34.8543 82.5628
frequency: 21.2794 34.5583 82.5340 91.1282 102.2637 128.5932 144.1853 176.0571 224.6477 257.7350 317.6783 425.2613 456.6854 474.4714 516.2989 558.3208 621.6326 657.7233 681.0297 759.8798 786.4362 822.3042 842.3281 872.8612 941.2859 946.3253 982.4866 1029.8204 1036.3318 1077.5989 1086.7129 1099.4830 1114.0110 1131.3975 1149.4038 1157.1305 1182.1786 1210.9751 1253.2872 1278.1496 1283.0885 1300.7466 1325.3159 1345.5977 1377.0155 1423.5488 1443.9759 1450.6451 1453.7476 1458.3181 1464.1738 1474.3563 1643.5928 1707.1368 2996.0420 3003.7154 3005.3565 3020.1344 3024.4577 3040.8588 3053.6719 3072.3896 3088.9235 3104.1411 3106.1783 3149.8053
redmass: 7.0751 4.8777 3.4182 3.7967 1.0924 2.7337 2.5099 3.0886 3.8775 4.1827 3.7789 4.7368 3.2993 4.0331 2.6728 2.7456 5.9392 4.7548 2.7151 3.6555 1.8840 2.6562 2.7899 3.8767 3.0913 3.3171 2.4891 2.0783 2.7128 2.3996 2.2522 3.2349 1.2663 1.8661 1.4381 1.7763 1.3087 1.6005 1.3135 1.2017 1.3318 1.4541 1.3665 1.4007 1.6936 1.1964 1.0761 1.0797 1.0500 1.0914 1.0509 1.0938 8.8945 12.6485 1.0615 1.0436 1.0456 1.0634 1.0652 1.0935 1.0935 1.0998 1.1016 1.1009 1.1046 1.1047
irintensity: 2.9577 1.0163 4.5856 3.9065 0.2270 0.6035 2.5624 10.5552 2.9550 11.5623 9.8513 7.0539 4.4106 4.3861 2.5413 2.1195 8.3142 4.4790 14.1100 15.0544 7.4284 2.2495 42.2741 64.1792 24.3174 12.9688 2.2343 11.2925 87.8441 7.8597 60.5497 183.2340 0.2018 78.4741 4.1553 147.4341 5.0469 19.9142 26.6510 4.4055 24.8245 38.7528 4.9361 39.4013 2.3469 24.0084 15.1882 8.3188 14.5409 33.7959 15.1763 13.2713 162.2243 339.9878 7.2706 37.2310 10.1622 11.0882 18.3026 5.4655 9.4676 45.2550 10.9574 19.4319 27.5391 16.1218
temp: 298.150 k
press: 1.00000 atm
elementType: 8 8 8 8 6 6 6 6 6 6 6 6 1 1 1 1 1 1 1 1 1 1 1 1
symmnumber: 1
zpe: 505717.7 jmol-1
zpe.correction: 0.192618 hartree
zpe.thermalcorrener: 0.205270 hartree
zpe.thermalcorrenthalpy: 0.206214 hartree
zpe.thermalcorrgfe: 0.151271 hartree
zpe.sumelectzpe: -612.015139 hartree
zpe.sumelectthermal: -612.002486 hartree
zpe.sumelectthermalent: -612.001542 hartree
zpe.sumelectthermalfe: -612.056485 hartree
dipole: -1.4000 -4.1578 -0.9496
dipole: 4.4888
quadrupole: -62.4813 -77.1505 -73.1276
quadrupole: -17.0885 2.2162 3.3007
quadrupole: 8.4385 -6.2307 -2.2078 -17.0885 2.2162 3.3007
hfenergy: -612.2077563 hartree
pointgroup: C01 [X(C8H12O4)]
dipole: 0.6495348 -1.5677645 0.4889746 debye
dipolederiv: -1.1199335 0.4068683 -0.3520434 0.213117 -0.636265 0.0360009 -0.5260023 0.2731871 -0.6100341 -0.6611174 0.2558739 -0.1654923 0.4374281 -0.9924668 0.1887726 -0.2319464 0.1359281 -0.437987 -1.3777021 -0.3878275 -0.0574237 -0.4763591 -0.525066 -0.120297 -0.1379634 -0.1525301 -0.4696146 -0.6682128 -0.0305254 0.1351012 -0.2083652 -0.5062409 -0.2179233 -0.1206498 -0.3243696 -0.735137 0.5352222 -0.1096294 0.0138773 -0.369214 0.5159499 -0.1220664 -0.0736161 -0.0253865 0.3553536 -0.057071 -0.0585765 -0.1007261 0.0144912 0.0081957 0.0180915 -0.0750479 -0.0338343 0.0495693 -0.0412335 -0.0065464 0.0426243 0.0298529 0.045686 -0.0204088 0.1109959 -0.0351836 0.0065868 0.0071001 -0.0603932 -0.1179551 -0.0988974 -0.3171948 -0.1165894 -0.1269552 -0.1157473 0.0011661 -0.2730895 -0.0393098 0.1501409 0.1106785 0.031754 -0.1064239 0.2553232 -0.0766965 -0.0301714 1.247781 -0.5252678 0.614223 -0.3509007 1.2782061 -0.0800486 0.862553 -0.3018571 0.7023801 1.5502222 0.369861 -0.0917584 0.5673351 0.633347 0.4103069 0.1892873 0.5253971 0.8913037 0.5962472 0.0847712 -0.0375522 0.0436539 0.2735455 -0.0298642 -0.1464488 -0.0621515 0.2490892 0.0161701 0.0275041 -0.0511809 0.053578 0.0243288 0.016984 -0.040692 0.0426224 -0.1302663 -0.0618259 -0.058344 0.0906153 -0.0230066 0.0657719 0.0339708 0.0911383 0.0691283 -0.0488638 0.0822813 0.0908458 0.024515 0.0701662 -0.093031 -0.038114 0.0243851 -0.0762489 0.0590816 0.0654931 0.0040583 -0.0520305 -0.0210297 0.0745989 0.0248168 -0.0711788 0.0078277 -0.0864445 0.017468 0.0598088 -0.016242 0.0340591 -0.1270944 0.0330752 -0.013126 0.0237562 0.0865125 -0.0853761 -0.0172283 -0.036421 0.0068592 0.0952093 0.0055837 -0.0142062 0.0218516 0.1083021 0.0905935 0.0238784 0.089175 0.0010327 0.0673785 0.0072388 0.0511743 0.020946 -0.0447664 0.0463363 -0.0127863 -0.0347213 -0.037738 0.0941366 0.0508809 -0.0603231 0.0152765 -0.0718036 0.1291149 0.0287309 0.0210591 -0.0152784 -0.0242097 0.0256782 -0.0081075 0.0244866 0.1024047 -0.0156102 0.0131321 0.0205241 0.1087247 -0.0903561 -0.0096104 0.0798774 0.0071446 0.0858369 -0.0248786 -0.0760863 -0.0424099 -0.1016684 0.0478648 -0.0636346 -0.0795637 -0.0773784 0.0385332 0.0020208 0.0171884 -0.0458983 0.0114809 0.0559515 0.0735803 0.0610928 0.1138319 -0.0710312 unknown
polarizability: 116.8306566|1.0255515|88.4761061|4.3647916|0.066774|80.1253459 unknown
InChI: InChI=1S/C8H12O4/c1-11-7(9)4-2-6-3-5-8(10)12-6/h6H,2-5H2,1H3
charge 0 multiplicity 1
24 atoms
O  -1.686201 0.690291 0.874519
O  -3.265179 1.842421 -0.381298
O  3.481558 0.72208 0.39541
O  2.547087 -0.605763 -1.274472
C  -1.209959 -0.732511 1.008467
C  -2.390235 -1.588526 0.468939
C  0.099245 -0.902489 0.22387
C  -3.083912 -0.653925 -0.54696
C  1.188598 0.085954 0.679869
C  -2.7479 0.762179 -0.060774
C  2.434604 0.001061 -0.184061
C  4.745746 0.757586 -0.380654
H  -1.040904 -0.874353 2.089908
H  -3.084064 -1.838587 1.290109
H  -2.034541 -2.529556 0.018162
H  -0.08481 -0.772127 -0.858845
H  0.453503 -1.94298 0.358727
H  -4.17629 -0.778357 -0.604031
H  -2.684036 -0.770596 -1.571233
H  1.476493 -0.077501 1.735183
H  0.798931 1.120916 0.628905
H  5.13872 -0.263726 -0.518883
H  5.429348 1.367749 0.225748
H  4.573796 1.215559 -1.369208
