program: Gaussian 09
title: 000299809
version: EM64L-G09RevD.01
frameworkgroup: C1[X(C8H9BrO4)]
method: RPBEPBE
basis: SDD
operation: Freq
keyword: #p
keyword: freq=noraman
keyword: PBEPBE/SDD
title: #p freq=noraman PBEPBE/SDD
converged: YES YES NO NO
title: Mulliken charges:
elementType: Br O O O O C C C C C C C C H H H H H H H H H
charge: 0.013598 -0.188222 -0.178441 -0.405521 -0.225343 -0.311985 -0.029214 -0.190271 -0.518127 -0.525019 -0.457628 0.176932 0.150486 0.304659 0.286902 0.299966 0.266876 0.263959 0.337157 0.289432 0.254281 0.385524
chargesum: 0.00000
title: Mulliken charges with hydrogens summed into heavy atoms:
elementType: Br O O O O C C C C C C C C
charge: 0.013598 -0.188222 -0.178441 -0.019997 -0.225343 -0.007326 0.257687 0.109695 0.012708 -0.187862 0.086085 0.176932 0.150486
polarizability: 1.36011649e+02 3.77344993e+00 1.00066409e+02 -3.13032069e-01 -6.35466777e+00 8.35461674e+01
1716.lowfreq: -19.1890 -7.5047 0.0008 0.0009 0.0009 8.5024 34.8502 66.3383 95.4693
frequency: 34.7858 66.3033 95.4352 125.9425 163.6737 183.9179 225.6315 266.8584 292.3123 365.1615 387.1069 466.8712 499.7632 538.3195 590.7087 631.3266 635.9107 665.9029 696.6109 722.6763 771.8429 819.8581 832.6349 847.2106 869.4323 906.8901 930.8109 989.0585 997.8353 1024.3759 1052.2903 1060.7600 1085.2525 1108.3532 1149.3688 1181.6219 1189.6554 1220.1100 1233.0805 1255.8867 1264.7188 1297.6028 1307.7351 1315.0933 1332.8777 1343.3372 1368.2886 1467.0924 1477.9255 1649.0204 1714.2848 3029.5639 3034.9149 3043.8671 3080.6678 3099.2811 3101.3848 3103.6864 3118.4487 3508.0833
redmass: 10.9153 9.9619 8.4731 7.5579 6.0080 5.4490 10.4081 7.2413 3.7755 3.2296 2.8533 4.8059 5.0865 3.5456 2.1502 4.3482 2.3523 5.8901 3.8636 5.4370 3.9007 4.9356 4.4670 3.1170 2.9621 2.5940 3.1404 2.5929 1.9879 2.6087 2.3299 2.1999 2.0050 2.7968 1.1751 1.3988 1.1809 1.4428 1.3443 1.5879 1.4752 1.4400 1.4286 1.3822 1.3835 1.6307 1.5954 1.0821 1.0933 8.2732 12.4560 1.0656 1.0610 1.0812 1.0886 1.1012 1.0902 1.1019 1.0914 1.0641
irintensity: 1.1778 0.0853 2.5880 5.7907 0.0594 0.2866 1.5749 6.8827 4.5392 8.1537 3.7834 2.8190 32.8612 17.7324 81.2024 12.2360 45.5590 19.4490 23.0968 26.9947 2.1829 29.1566 28.2553 24.0035 13.7544 23.5159 24.7916 4.9628 26.1107 168.2579 75.3155 133.8496 117.2027 5.2395 15.4927 2.7823 20.4766 3.7381 11.8198 0.3470 9.4115 13.8610 0.5322 4.4752 8.7324 5.0101 36.2381 18.1311 17.5555 188.2537 320.6492 3.0204 15.0602 7.8158 4.5767 1.2354 4.4905 13.2723 9.7049 35.6334
temp: 298.150 k
press: 1.00000 atm
elementType: 35 8 8 8 8 6 6 6 6 6 6 6 6 1 1 1 1 1 1 1 1 1
symmnumber: 1
zpe: 429695.2 jmol-1
zpe.correction: 0.163662 hartree
zpe.thermalcorrener: 0.175211 hartree
zpe.thermalcorrenthalpy: 0.176155 hartree
zpe.thermalcorrgfe: 0.124197 hartree
zpe.sumelectzpe: -623.639666 hartree
zpe.sumelectthermal: -623.628118 hartree
zpe.sumelectthermalent: -623.627174 hartree
zpe.sumelectthermalfe: -623.679132 hartree
dipole: 3.6666 -2.9454 2.3081
dipole: 5.2390
quadrupole: -80.5851 -101.0125 -80.4635
quadrupole: -5.5667 2.3800 8.1347
quadrupole: 6.7686 -13.6588 6.8902 -5.5667 2.3800 8.1347
hfenergy: -623.8033285 hartree
pointgroup: C01[X(C8H9Br1O4)]
dipole: 1.7759879 -0.0089019 1.0460428 debye
dipolederiv: -0.3601122 -0.2758631 -0.0556015 -0.231523 -0.4077633 -0.0938529 -0.0656937 -0.128317 -0.1798044 -0.5593457 -0.3014105 0.1880511 -0.1065666 -0.9857073 0.3206758 0.0041241 0.3639494 -0.4890164 -0.5037755 0.1727492 -0.1210574 0.0614814 -0.8987344 0.3231981 -0.1227079 0.4857945 -0.5563739 -0.9931765 -0.514177 0.1476856 -0.5067222 -0.6584163 0.0197625 0.0822772 -0.0197422 -0.3486958 -0.7001332 0.0875344 -0.1164565 -0.1081508 -0.8004275 0.1738431 -0.0634102 0.2912028 -0.4113062 -0.2348537 0.0845473 -0.1131181 0.0501494 0.0530949 0.0704494 -0.2358696 0.0988406 0.0291131 0.1648487 -0.3930028 -0.0313636 -0.0356312 0.4792905 -0.1025583 -0.0269878 -0.2347172 0.3244993 -0.2036805 0.0358503 -0.0402513 0.1448886 0.023914 0.0510086 -0.0168789 0.1021702 0.061041 -0.0022936 0.0831654 0.0122595 -0.1323837 -0.0782543 -0.0064181 -0.0090626 0.0099036 -0.0092472 0.468559 0.5103759 0.1081973 0.4258027 0.4933742 0.149706 0.1796041 0.2084872 0.1080964 -0.0079986 -0.0730027 0.0358603 -0.0897808 -0.0719265 0.0052092 -0.097531 -0.0741714 0.0079251 0.9719914 0.2012191 -0.0120688 0.0898788 1.4054638 -0.6516425 0.235525 -0.8038139 0.6127266 1.5234423 0.2843216 0.0885879 0.3965884 1.1024727 -0.3473419 0.2174425 -0.4248132 0.3385619 0.0378823 -0.0641331 0.0023285 -0.0670632 -0.0237227 -0.0265096 0.0061514 -0.0060193 0.0673088 -0.004333 -0.012875 0.0764907 -0.0144871 0.032813 0.0424215 0.0475363 0.0573441 0.0090036 0.021929 -0.0393839 0.0248309 -0.0672545 0.0242546 0.0499598 0.0234797 0.0317394 -0.012701 0.0253193 0.0723945 -0.0769682 0.0722472 0.0453927 0.0806641 -0.0578755 0.0481885 0.0787357 0.0368478 0.0077435 0.053755 0.0002635 -0.0279055 -0.1205434 0.0488631 -0.0909047 -0.0195369 0.0060372 0.0062525 -0.0726016 -0.0565285 -0.0186208 -0.0027182 -0.0623406 -0.0155501 0.0022619 0.0051917 0.0053859 -0.0749394 0.0077861 0.0612593 0.0548634 -0.0321757 0.0551178 0.0342748 0.0363557 0.0612393 0.0589155 0.0539746 -0.0134292 -0.0797302 0.0575603 -0.0378675 0.0478798 0.2712981 0.0610692 -0.0825358 0.1130309 0.2635781 0.0895536 -0.1120301 0.0831785 0.3052537 unknown
polarizability: 116.8414201|18.4365767|118.6946746|7.0583965|-2.3707436|84.0881313 unknown
InChI: InChI=1S/C8H9BrO4/c9-5-1-3(7(10)11)4-2-6(5)13-8(4)12/h3-6,10H,1-2H2
charge 0 multiplicity 1
22 atoms
Br -2.189302 -2.818056 -0.480225
O  -2.095706 0.576204 0.153853
O  -1.459196 2.476695 -1.043266
O  3.25191 0.733601 -0.181052
O  2.447374 -1.303159 0.590392
C  0.21384 1.200844 0.34297
C  -1.367305 -0.411644 1.029559
C  0.945169 0.227001 -0.656286
C  -0.214184 0.441519 1.621298
C  -0.750973 -1.533742 0.177228
C  0.02422 -0.975649 -1.034457
C  -1.156279 1.55089 -0.279786
C  2.251537 -0.229816 -0.024625
H  0.812259 2.108112 0.508467
H  -2.104091 -0.780678 1.755716
H  1.193622 0.798125 -1.56847
H  0.582015 -0.172901 2.071321
H  -0.604689 1.136753 2.383679
H  -0.113577 -2.169366 0.812022
H  -0.703772 -0.628918 -1.78854
H  0.617012 -1.782507 -1.495659
H  4.090618 0.424191 0.258559
