program: Gaussian 09
title: 000299791
version: EM64L-G09RevD.01
frameworkgroup: C1[X(C12H15NO3)]
method: RPBEPBE
basis: SDD
operation: Freq
keyword: #p
keyword: freq=noraman
keyword: PBEPBE/SDD
title: #p freq=noraman PBEPBE/SDD
converged: YES YES NO NO
title: Mulliken charges:
elementType: O O O N C C C C C C C C C C C C H H H H H H H H H H H H H H H
charge: -0.295921 -0.410191 -0.252081 -0.176092 -0.547108 0.413842 -0.462617 -0.310430 -0.473158 -0.822168 0.171839 -0.091219 0.217625 -0.327794 -0.297546 -0.146471 0.222502 0.249117 0.233785 0.277770 0.251024 0.234697 0.246088 0.230718 0.239538 0.230282 0.289041 0.248314 0.241174 0.233581 0.381860
chargesum: 0.00000
title: Mulliken charges with hydrogens summed into heavy atoms:
elementType: O O O N C C C C C C C C C C C C
charge: -0.295921 -0.028331 -0.252081 -0.176092 -0.075490 0.413842 0.048937 -0.059406 0.007627 -0.121630 0.171839 0.197823 0.217625 -0.079480 -0.056372 0.087110
polarizability: 1.83525328e+02 1.36609839e+01 1.45186004e+02 -1.51039691e+01 9.20119263e+00 1.06447566e+02
1716.lowfreq: -16.4353 -5.1285 0.0003 0.0007 0.0009 2.2795 18.9976 22.0925 32.9555
frequency: 15.6874 20.9383 32.9335 42.6780 54.9568 79.6158 97.6260 139.0905 175.5682 205.6038 223.4219 279.3563 314.0690 339.8674 398.0928 411.8827 416.7085 479.8031 516.5236 525.6523 533.1368 534.5169 556.0940 591.6439 616.0982 697.4593 715.7357 732.8334 767.7099 773.7103 784.0218 845.4203 848.2404 883.1008 913.0685 937.3255 953.6144 966.4104 985.2769 989.4876 1002.2295 1018.2445 1042.4808 1071.9300 1079.4731 1119.8015 1124.3957 1160.2764 1175.9798 1187.4220 1200.8876 1219.1117 1231.6517 1285.8628 1289.2072 1300.3352 1343.9437 1347.9099 1370.0466 1387.7384 1400.4945 1447.6784 1452.0105 1462.0146 1471.3302 1474.6970 1488.9512 1544.0261 1561.7404 1649.2435 1657.1859 1687.5780 2973.1164 2987.4415 3000.9585 3033.5376 3044.3978 3058.2982 3063.0365 3091.9269 3096.9920 3107.1220 3135.2995 3156.7507 3179.6136 3191.9440 3511.5951
redmass: 3.7898 4.2937 4.4867 4.7691 6.8963 5.5730 1.2640 4.6044 3.0432 4.9322 4.0048 3.8162 2.5251 3.4393 2.4323 2.2773 3.2916 3.8844 3.0092 3.9666 3.6614 3.2381 3.5160 5.9930 1.2736 2.8979 3.5115 3.9748 1.4446 2.3213 3.5510 3.8607 1.4887 1.7764 2.1631 2.0499 1.3961 1.7807 1.3042 2.5807 1.8928 2.3269 1.5420 1.9044 2.9824 2.2688 1.6192 2.1127 1.3604 1.1927 1.3380 1.8661 1.3898 1.4612 1.8603 1.2524 1.4621 1.7269 1.4698 1.7774 1.2696 2.0220 1.0929 1.1058 1.1100 1.0621 1.1190 6.8683 5.8095 7.0403 8.2711 6.7725 1.0396 1.0622 1.0597 1.0599 1.0961 1.1001 1.1000 1.0908 1.0953 1.1037 1.0891 1.0913 1.0944 1.0994 1.0640
irintensity: 1.1272 1.2896 2.2844 1.8465 4.2167 0.8320 0.8024 2.9081 0.2399 3.2224 0.8945 1.8559 1.1746 4.1805 1.1311 2.7586 9.7937 14.3570 14.4413 39.5938 3.8004 4.5111 2.6659 3.0792 139.0940 46.5418 1.1537 1.9562 94.2545 1.2992 0.5335 5.4332 5.8671 31.0732 7.8202 34.9906 6.2036 0.5760 0.1914 4.7897 77.0613 9.1656 2.3834 113.0137 3.6135 19.5837 41.0207 22.2942 22.8324 7.3823 2.8088 2.5905 3.0326 23.7230 8.2772 2.8720 46.6648 21.7860 2.0939 18.9885 19.8987 3.4103 15.1344 7.1193 2.5484 20.9248 38.6092 34.6932 218.3396 203.2257 232.2114 3.2927 24.2536 40.5834 41.7453 18.4617 18.0024 11.0961 13.6795 5.8314 43.7069 14.2057 19.3012 3.3975 7.1062 6.0992 20.1992
temp: 298.150 k
press: 1.00000 atm
elementType: 8 8 8 7 6 6 6 6 6 6 6 6 6 6 6 6 1 1 1 1 1 1 1 1 1 1 1 1 1 1 1
symmnumber: 1
zpe: 653656.8 jmol-1
zpe.correction: 0.248965 hartree
zpe.thermalcorrener: 0.265148 hartree
zpe.thermalcorrenthalpy: 0.266092 hartree
zpe.thermalcorrgfe: 0.201596 hartree
zpe.sumelectzpe: -745.502313 hartree
zpe.sumelectthermal: -745.486130 hartree
zpe.sumelectthermalent: -745.485186 hartree
zpe.sumelectthermalfe: -745.549681 hartree
dipole: -4.4268 1.9415 0.8267
dipole: 4.9040
quadrupole: -95.2567 -93.0598 -98.2547
quadrupole: 17.0373 4.7744 -7.1660
quadrupole: 0.2670 2.4639 -2.7310 17.0373 4.7744 -7.1660
hfenergy: -745.7512774 hartree
pointgroup: C01 [X(C12H15N1O3)]
dipole: -1.7503874 0.7255581 0.3636285 debye
polarizability: 182.1993598|14.6762251|145.80636|-16.9685982|8.5404917|107.1531782 unknown
InChI: InChI=1S/C12H15NO3/c1-10(5-6-12(15)16)7-9-13-8-3-2-4-11(13)14/h2-4,7-8,15H,5-6,9H2,1H3
charge 0 multiplicity 1
31 atoms
O  3.338403 -1.651332 -0.909878
O  -2.573516 1.934096 -1.259461
O  -2.090884 1.778719 1.004874
N  1.65764 -0.400851 0.184429
C  -3.057831 -1.059681 -0.600663
C  -1.799846 -1.471993 0.158995
C  0.77511 -1.61156 0.159043
C  -0.580258 -1.307122 -0.431268
C  -3.730936 0.229614 -0.013078
C  -2.026982 -2.019437 1.556092
C  2.980592 -0.542361 -0.391726
C  1.212054 0.77354 0.762484
C  -2.743538 1.375584 0.014465
C  3.798886 0.658651 -0.312167
C  2.018349 1.901235 0.827273
C  3.340248 1.830836 0.275545
H  -3.815038 -1.867712 -0.563991
H  -2.820258 -0.873551 -1.662799
H  0.703766 -2.017804 1.183151
H  1.331027 -2.345107 -0.455249
H  -0.547286 -0.906154 -1.455343
H  -4.078089 0.053976 1.01792
H  -4.596343 0.498992 -0.642525
H  -2.645935 -2.937053 1.51518
H  -2.573165 -1.290205 2.18455
H  -1.092139 -2.272825 2.080995
H  0.188568 0.770661 1.149983
H  4.801174 0.579673 -0.74209
H  1.634666 2.810442 1.294571
H  3.993228 2.71042 0.316797
H  -1.876566 2.644506 -1.219909
