program: Gaussian 09
title: 000299767
version: EM64L-G09RevD.01
frameworkgroup: C1[X(C8H10ClN)]
method: RPBEPBE
basis: SDD
operation: Freq
keyword: #p
keyword: freq=noraman
keyword: PBEPBE/SDD
title: #p freq=noraman PBEPBE/SDD
converged: NO YES NO NO
title: Mulliken charges:
elementType: Cl N C C C C C C C C H H H H H H H H H H
charge: -0.080934 -0.623856 -0.202695 0.555262 -0.698019 -0.345142 -0.373109 -0.231985 -0.233790 -0.231468 0.226827 0.238258 0.234141 0.208548 0.295683 0.271150 0.277224 0.253065 0.228667 0.232175
chargesum: 0.00000
title: Mulliken charges with hydrogens summed into heavy atoms:
elementType: Cl N C C C C C C C C
charge: -0.080934 -0.075482 0.024132 0.555262 -0.017073 -0.345142 -0.077426 0.021080 -0.005122 0.000707
polarizability: 1.20469701e+02 -5.99557780e+00 1.16651655e+02 2.04545874e+00 -6.94919872e-01 5.66760003e+01
1716.lowfreq: -10.9579 -3.2954 -0.0017 -0.0011 -0.0010 12.0554 60.1661 113.5719 170.7347
frequency: 60.0449 113.5684 170.7344 183.0869 230.3577 268.9112 286.3582 319.5389 387.0714 391.5101 461.9151 486.4904 546.9250 580.9251 653.8402 682.6476 733.0383 759.4583 766.8410 880.2005 908.7465 961.3458 986.4080 1001.8853 1009.2836 1025.7039 1044.7747 1100.9883 1141.3295 1165.6084 1179.5236 1227.5965 1272.4530 1321.8152 1342.7782 1379.1256 1385.6351 1425.7894 1451.6308 1470.6084 1474.2400 1572.7977 1603.2135 1641.6903 2923.0977 2979.1300 3075.0523 3104.2964 3130.1770 3144.0030 3155.8064 3170.5673 3446.8095 3575.7035
redmass: 3.1797 3.4859 4.7233 4.2622 1.1906 1.6936 1.6401 3.8168 4.6162 4.0366 3.4642 3.7609 3.5916 2.5389 2.5129 2.5090 4.5189 2.7514 1.3385 1.3318 2.3852 1.3415 1.4988 1.3159 6.7656 1.9207 1.6144 2.0222 1.9732 1.0904 1.8256 1.4649 1.5402 1.3867 1.9820 1.5291 2.2267 2.1415 2.2712 1.0440 1.1240 6.2949 6.9547 1.1027 1.0826 1.0369 1.0980 1.1002 1.0855 1.0900 1.0951 1.0996 1.0451 1.0975
irintensity: 0.6214 2.3990 1.8472 3.9047 9.9442 8.2120 36.9388 0.7928 9.6218 0.8952 12.8548 0.9845 8.3076 55.4556 116.5593 20.4650 0.8256 28.5139 69.0945 0.8667 2.4412 3.3016 1.4485 3.0823 50.7684 10.1000 3.1303 9.0283 16.3599 4.2454 8.5593 4.5603 15.9710 5.0260 13.6792 15.2114 17.6101 27.9101 28.2003 11.6350 6.3213 13.4834 1.7628 55.1327 32.3421 37.0702 38.1938 16.5803 3.8728 2.4321 15.3104 18.3364 0.4049 0.4226
temp: 298.150 k
press: 1.00000 atm
elementType: 17 7 6 6 6 6 6 6 6 6 1 1 1 1 1 1 1 1 1 1
symmnumber: 1
zpe: 423257.2 jmol-1
zpe.correction: 0.161210 hartree
zpe.thermalcorrener: 0.171101 hartree
zpe.thermalcorrenthalpy: 0.172045 hartree
zpe.thermalcorrgfe: 0.125881 hartree
zpe.sumelectzpe: -824.912654 hartree
zpe.sumelectthermal: -824.902763 hartree
zpe.sumelectthermalent: -824.901819 hartree
zpe.sumelectthermalfe: -824.947984 hartree
dipole: -0.7237 -1.1645 -0.5019
dipole: 1.4600
quadrupole: -55.0503 -68.3636 -67.5488
quadrupole: -1.1958 2.7450 1.2466
quadrupole: 8.6039 -4.7093 -3.8946 -1.1958 2.7450 1.2466
hfenergy: -825.0738644 hartree
pointgroup: C01 [X(C8H10Cl1N1)]
dipole: 0.2567799 0.3889489 -0.335776 debye
dipolederiv: -0.2155967 0.1739288 -0.0369542 0.1642637 -0.7218369 0.1485611 -0.0378691 0.1504404 -0.1260332 -0.4719359 -0.0069247 0.1525443 -0.0502246 -0.6535161 0.0784598 0.1712767 0.0764767 -0.4207672 0.4089194 0.1437758 -0.2020497 0.0716596 0.3602315 -0.0408802 -0.3254255 -0.1235591 0.3743108 0.1225622 0.0326395 0.064695 -0.0153635 -0.3147206 0.0758884 0.083752 0.0807382 -0.0791909 -0.0210075 -0.0225685 -0.0413886 -0.0331265 0.0484027 0.0123561 0.0775812 0.0101005 -0.0949353 0.1520921 -0.282849 0.0474186 -0.2332545 0.9902489 -0.266722 0.0501281 -0.2712434 -0.0135892 -0.1133319 -0.0272359 -0.0084301 0.0658522 0.0058718 -0.0329489 -0.0370309 -0.0368708 -0.1361169 -0.0900587 0.1076092 -0.0276475 0.1188351 -0.197769 0.0170807 -0.0365774 0.0185151 -0.10757 -0.0302371 -0.0564952 0.0004478 -0.059435 0.0820185 -0.0585799 0.0086043 -0.058654 -0.1425168 0.0592488 0.0157958 -0.030606 -0.0495432 0.0026004 -0.0383178 -0.009445 -0.0503141 -0.1526843 -0.0135144 -0.0151006 0.0250786 0.0180824 -0.1765135 -0.0252115 0.0094238 -0.0250376 -0.0099206 0.078283 -0.065247 0.0795061 -0.0366757 0.0206825 0.1070819 0.0698429 0.0607679 -0.003549 0.0882716 0.0538849 -0.0044037 0.0067833 -0.100088 -0.0973058 -0.0051601 -0.0251452 0.0683697 -0.2438788 0.0427663 -0.0302684 0.0418082 0.0889715 -0.0158309 -0.020045 -0.0120252 0.0656728 0.1297586 -0.0512597 0.0117165 -0.0630916 0.0220348 0.0362417 0.0032245 0.0371087 0.1389075 0.2279632 -0.0601041 -0.0255653 -0.0827631 0.2364463 -0.0636051 -0.0375367 -0.0129475 0.0023678 -0.0290369 -0.0337674 -0.0070523 0.0914531 0.3044319 0.0374448 -0.0039452 0.0538175 0.1878536 0.0351124 -0.0601307 0.0268282 -0.0800902 0.0122925 0.0472537 0.0332646 0.0475635 0.1490374 0.0476767 0.0699073 -0.0086741 0.0875409 -0.0841348 0.0582194 -0.0061382 0.0606336 0.1437815 -0.1212903 0.0413751 0.0148048 0.0372894 0.0743456 0.0208145 0.0120751 0.0196349 0.1565724 unknown
polarizability: 121.0890256|-6.2744051|110.7430776|-0.7525|-16.8494991|61.9652531 unknown
InChI: InChI=1S/C8H10ClN/c1-6(10)7-4-2-3-5-8(7)9/h2-6H,10H2,1H3
charge 0 multiplicity 1
20 atoms
Cl -0.013436 -2.615933 0.669403
N  2.461156 0.808358 -1.079932
C  1.822103 -0.141036 -0.140738
C  0.30574 0.087718 -0.101999
C  2.432627 0.070743 1.267994
C  -0.615444 -0.923323 0.259256
C  -0.234316 1.367193 -0.393724
C  -2.004568 -0.705416 0.331573
C  -1.621707 1.617727 -0.32838
C  -2.511453 0.579938 0.033972
H  1.994484 -1.204222 -0.422078
H  1.960621 -0.600554 2.004606
H  2.280465 1.116642 1.588255
H  3.51883 -0.143399 1.255463
H  0.483445 2.144186 -0.678824
H  2.214769 0.651388 -2.063551
H  3.473915 0.890125 -0.945248
H  -2.673793 -1.523806 0.613998
H  -2.007798 2.617032 -0.557839
H  -3.59074 0.759437 0.086695
