program: Gaussian 09
title: 000299867
version: EM64L-G09RevD.01
frameworkgroup: C1[X(C20H19N5O6)]
method: RPBEPBE
basis: SDD
operation: Freq
keyword: #p
keyword: freq=noraman
keyword: PBEPBE/SDD
title: #p freq=noraman PBEPBE/SDD
converged: YES YES NO NO
title: Mulliken charges:
elementType: O O O O O O N N N N N C C C C C C C C C C C C C C C C C C C C H H H H H H H H H H H H H H H H H H H
charge: -0.282122 -0.397522 -0.239720 -0.232576 -0.418249 -0.216267 -0.431395 -0.417842 -0.458160 -0.036579 -0.622605 0.438269 -0.501635 0.057763 0.416659 -0.110407 -0.558217 0.486546 -0.346390 -0.400930 0.269504 -0.525535 -0.370007 -0.444494 0.201861 -0.372875 -0.338114 -0.022533 0.129979 0.157702 0.210630 0.238076 0.222843 0.321041 0.287260 0.302332 0.259648 0.229838 0.286233 0.246908 0.295444 0.239243 0.219296 0.305298 0.270305 0.211930 0.312919 0.360026 0.387041 0.379580
chargesum: 0.00000
title: Mulliken charges with hydrogens summed into heavy atoms:
elementType: O O O O O O N N N N N C C C C C C C C C C C C C C C C C C C C
charge: -0.282122 -0.010481 -0.239720 -0.232576 -0.038670 -0.216267 -0.129063 -0.122398 -0.152862 -0.036579 0.050340 0.438269 -0.040716 0.057763 0.416659 0.210635 -0.270958 0.486546 -0.086742 -0.171092 0.269504 0.007606 -0.130764 -0.225198 0.201861 -0.102571 -0.126184 -0.022533 0.129979 0.157702 0.210630
polarizability: 4.87499863e+02 1.47860599e+01 2.45998109e+02 -2.13656399e+01 -5.67140680e+00 1.80787755e+02
1716.lowfreq: -7.8297 -4.0461 -0.7560 -0.0007 -0.0004 0.0013 4.3653 7.2305 15.9599
frequency: -5.1629 7.0792 15.9546 23.7445 28.7383 31.0210 37.1189 45.1083 58.8558 67.2980 80.7147 90.4439 108.9715 126.2407 143.2433 152.9821 166.8101 189.9550 207.3256 214.4049 241.9101 252.4360 272.3562 291.1001 310.7999 326.8795 342.6449 352.7439 358.0179 408.7911 412.0168 421.1865 426.7299 439.7729 457.6070 478.8802 487.6372 494.1589 509.5846 523.2432 529.6683 545.9043 554.4791 555.5474 567.2707 572.5966 589.4096 601.5612 627.2728 632.5950 633.2359 661.5713 667.6392 683.7588 688.7090 695.3577 698.4458 728.8131 754.9474 784.6810 809.1398 811.2864 821.7632 831.2044 835.8812 841.9274 852.5217 892.5258 897.0762 928.1578 939.3266 941.5176 965.2527 972.5508 982.0142 993.7878 997.1634 1020.9974 1027.8143 1066.3084 1077.2566 1086.6740 1102.7594 1115.1204 1131.8516 1148.3169 1159.1676 1193.7073 1197.0065 1197.9079 1212.4337 1225.1748 1258.1889 1264.5600 1270.6078 1273.1149 1282.3809 1285.3437 1311.8657 1315.0316 1333.5984 1340.8200 1356.5273 1363.1292 1370.7447 1406.5924 1412.6851 1435.3655 1442.6270 1463.5491 1470.5358 1473.7421 1489.3374 1496.6388 1528.2821 1564.3740 1569.6684 1586.6999 1599.2942 1604.3929 1630.8758 1636.9673 1639.2991 1646.1882 1676.4480 2943.8193 2981.8104 2994.4051 3009.6465 3079.0158 3109.6614 3122.2360 3134.0800 3142.5782 3146.7737 3148.5668 3166.8723 3510.3355 3512.7883 3538.5233 3550.2991 3555.1901 3558.8977 3701.9800
redmass: 7.2392 7.4945 6.4456 6.5976 9.8018 6.9927 5.9282 7.7386 5.9462 6.3680 5.4074 6.3528 4.8805 7.1473 5.1547 5.8996 4.9046 6.1608 3.3854 5.2828 4.1413 1.3116 4.7601 5.5353 3.9859 4.8585 4.3258 3.9359 3.7289 5.1578 2.9677 4.2694 2.7622 1.7122 3.2838 5.4919 2.7904 2.6780 2.4674 2.1005 1.1642 2.9116 4.1989 4.5716 3.0607 1.3433 6.2791 2.0448 3.3498 2.3222 5.7052 3.0985 2.2554 3.0584 3.6001 8.4227 5.5455 5.7154 4.6177 4.9963 1.7340 2.2607 2.1046 5.1518 1.7295 4.3405 4.4081 2.3098 4.3615 4.5029 1.3979 1.3841 1.3680 3.6181 1.3965 1.7898 2.8957 2.1217 3.0002 2.3938 2.9797 4.0689 2.5122 2.2248 1.4337 1.4226 2.0547 1.2303 2.1241 1.3292 1.2869 1.9530 1.4239 1.6543 2.4772 2.0098 1.6405 2.0188 1.6108 1.9425 1.4728 2.0328 1.8126 1.8951 3.5201 6.1203 3.6579 3.3963 1.2040 4.2739 1.8814 1.7932 1.5500 1.6811 3.2615 5.0000 6.7078 2.2608 6.1198 3.2583 5.9056 6.8240 2.4840 9.6033 8.7213 1.0615 1.0808 1.0994 1.0613 1.0995 1.0862 1.0882 1.0964 1.0921 1.0873 1.0966 1.0961 1.0639 1.0640 1.0756 1.0474 1.0770 1.0770 1.1052
irintensity: 4.3126 2.7409 0.7612 0.8245 0.8736 5.6616 0.9960 2.2194 2.8106 1.8302 1.5803 2.0454 3.1537 1.4194 5.6299 0.3373 2.1040 6.7798 5.4780 5.1277 13.4326 41.1775 2.3018 3.0098 9.4609 4.5386 4.5076 1.4550 3.9382 6.6003 6.1978 6.1095 25.2398 97.8692 41.2308 1.9997 10.4164 3.2872 31.9750 7.8554 353.8213 152.8658 50.1181 64.5354 16.1624 2.8242 3.7674 93.9138 36.1110 48.2736 2.7833 31.3844 70.0583 49.5517 23.0295 10.5603 0.4180 1.3051 18.8359 4.7808 10.4351 21.3946 62.2402 4.1602 47.3886 7.8201 15.2098 28.6766 5.2501 15.4176 15.2476 0.2051 3.4680 6.3748 1.3877 35.9152 1.3833 3.4972 92.5975 227.8102 118.8631 1.7825 16.6768 49.6679 39.0117 11.9590 47.1396 29.7597 3.8600 141.7279 109.3717 21.3641 8.1733 97.1048 14.2235 209.2542 10.1895 115.5220 15.6378 142.4386 101.6825 17.0071 56.0512 54.9939 170.3685 23.9425 151.8346 19.7806 124.2876 422.2555 280.5330 53.2255 11.0658 21.4413 143.5380 73.1776 578.4941 3.4895 218.3558 63.0628 769.9029 56.7612 336.4010 229.5360 201.5655 52.2319 43.0036 17.4200 8.3833 7.7173 21.1891 14.0784 22.0729 3.5859 8.7148 13.1037 15.6913 24.8388 32.4447 20.0684 152.2454 58.7005 11.1423 45.8081
temp: 298.150 k
press: 1.00000 atm
elementType: 8 8 8 8 8 8 7 7 7 7 7 6 6 6 6 6 6 6 6 6 6 6 6 6 6 6 6 6 6 6 6 1 1 1 1 1 1 1 1 1 1 1 1 1 1 1 1 1 1 1
symmnumber: 1
zpe: 983094.2 jmol-1
zpe.correction: 0.374441 hartree
zpe.thermalcorrener: 0.402542 hartree
zpe.thermalcorrenthalpy: 0.403487 hartree
zpe.thermalcorrgfe: 0.310439 hartree
zpe.sumelectzpe: -1496.479326 hartree
zpe.sumelectthermal: -1496.451224 hartree
zpe.sumelectthermalent: -1496.450280 hartree
zpe.sumelectthermalfe: -1496.543328 hartree
dipole: 6.8960 8.8507 -3.5120
dipole: 11.7569
quadrupole: -172.8620 -165.0268 -185.5040
quadrupole: 64.5682 31.9075 -5.8024
quadrupole: 1.6023 9.4375 -11.0397 64.5682 31.9075 -5.8024
hfenergy: -1496.8537663 hartree
pointgroup: C01 [X(C20H19N5O6)]
dipole: 2.7748883 -3.0356594 2.1166409 debye
polarizability: 488.1199255|-6.1597474|239.8540179|21.8534865|-19.1812092|186.3117831 unknown
InChI: InChI=1S/C20H19N5O6/c21-20-24-14-6-1-10(7-13(14)18(29)25-20)9-22-12-4-2-11(3-5-12)17(28)23-15(19(30)31)8-16(26)27/h1-7,15,22-24,26,30H,8-9,21H2
charge 0 multiplicity 1
50 atoms
O  -4.89797 0.199328 -1.965499
O  -6.353484 2.551915 0.380582
O  6.997301 2.655251 0.046717
O  -8.535106 1.762949 0.425469
O  -7.11345 -3.123252 1.844697
O  -7.117454 -2.724107 -0.443972
N  1.292592 0.107819 -0.005409
N  -5.239384 0.098898 0.332079
N  7.544928 -1.399224 0.360187
N  8.425265 0.846038 0.459907
N  9.817206 -0.978092 0.870351
C  3.671678 0.019458 -0.638285
C  2.283601 0.520509 -1.011429
C  6.033369 0.443071 -0.090104
C  6.248137 -0.957521 0.030277
C  -6.687748 0.137681 0.18011
C  4.739721 0.911651 -0.423125
C  -0.086244 0.137203 -0.196901
C  3.910628 -1.379402 -0.509082
C  5.183977 -1.871861 -0.177751
C  -2.935335 0.131687 -0.536094
C  -7.411261 -0.842831 1.133878
C  -0.676744 0.533323 -1.43658
C  -0.953646 -0.262308 0.867814
C  -4.405483 0.147623 -0.794034
C  -2.071607 0.516614 -1.593898
C  -2.345801 -0.261533 0.698307
C  7.166443 1.404081 0.138593
C  8.572631 -0.471972 0.555809
C  -7.307315 1.536773 0.343627
C  -7.193228 -2.285286 0.721418
H  2.303087 1.624258 -1.135513
H  1.985947 0.092669 -1.989952
H  -6.887028 -0.161986 -0.870664
H  4.609076 1.996913 -0.504882
H  1.641354 -0.042363 0.941977
H  3.083648 -2.079519 -0.674669
H  5.354292 -2.951529 -0.088142
H  -8.497542 -0.633739 1.090709
H  -7.094048 -0.706492 2.181974
H  -4.844356 0.303481 1.250538
H  -0.049014 0.865159 -2.268754
H  -0.519476 -0.588868 1.821184
H  7.715832 -2.402058 0.449387
H  -2.529271 0.807501 -2.545374
H  -2.96797 -0.615948 1.529441
H  10.024194 -1.969734 0.952866
H  10.555615 -0.291709 1.009502
H  -6.815723 3.433043 0.425027
H  -7.015033 -4.066566 1.539887
