program: Gaussian 09
title: 000299761
version: EM64L-G09RevD.01
frameworkgroup: C1[X(C11H14ClN3O3)]
method: RPBEPBE
basis: SDD
operation: Freq
keyword: #p
keyword: freq=noraman
keyword: PBEPBE/SDD
title: #p freq=noraman PBEPBE/SDD
converged: YES YES NO NO
title: Mulliken charges:
elementType: Cl O O O N N N C C C C C C C C C C C H H H H H H H H H H H H H H
charge: -0.082600 -0.331481 -0.206492 -0.210733 -0.397203 -0.395737 0.016092 -0.209085 0.523170 -0.735092 -0.538863 -0.387252 0.376502 0.321228 -0.202418 -0.377300 -0.332989 -0.550864 0.272397 0.205809 0.245015 0.234505 0.286729 0.293214 0.295195 0.240746 0.288392 0.298949 0.243870 0.267541 0.280478 0.268275
chargesum: 0.00000
title: Mulliken charges with hydrogens summed into heavy atoms:
elementType: Cl O O O N N N C C C C C C C C C C C
charge: -0.082600 -0.331481 -0.206492 -0.210733 -0.110474 -0.096788 0.016092 0.063312 0.523170 -0.049763 -0.245650 -0.092057 0.376502 0.321228 0.038328 -0.088908 0.178423 -0.002111
polarizability: 2.17461879e+02 5.71261528e+00 1.63298849e+02 1.67669640e+01 4.92529587e+00 1.11479569e+02
1716.lowfreq: -10.3339 -5.1933 -3.5676 -0.0016 0.0010 0.0014 11.5544 12.4852 32.1381
frequency: 11.4203 12.3732 32.0850 48.8327 58.8100 71.6114 101.1228 131.9716 134.4814 159.0503 180.0453 232.7408 249.8365 261.5915 281.4162 307.9426 335.5807 382.1369 390.4263 414.8521 429.2781 473.8870 476.9519 507.7883 553.7851 560.1156 594.3185 596.4045 654.3451 689.8421 696.9957 706.0446 714.4005 748.6423 827.6331 835.7479 857.2929 895.8047 936.2646 966.9762 970.8255 984.8223 988.8628 1012.0476 1036.0503 1046.8952 1069.6436 1090.3187 1107.3465 1114.7714 1152.1668 1179.6350 1185.5289 1207.2397 1219.6486 1227.1900 1243.3932 1279.9785 1297.7042 1312.5932 1339.1807 1369.7804 1370.0101 1394.9949 1402.1521 1437.0887 1438.6811 1441.4057 1454.6104 1475.8836 1477.2787 1481.8065 1507.5105 1586.4752 1615.2360 1615.6122 2984.8267 2996.3850 3029.2504 3054.7044 3066.2919 3078.5094 3101.4635 3133.3086 3154.2512 3157.2819 3177.0261 3186.2294 3536.1821 3546.3448
redmass: 7.4072 6.5941 5.8827 8.7963 10.5435 6.3211 3.6225 4.9146 4.8858 4.5883 4.3306 4.7057 3.2430 1.1147 4.7549 2.8276 2.5998 3.4624 1.9789 3.1170 3.4743 3.2517 3.4185 4.4746 4.1478 1.3778 4.3201 4.4710 7.4550 3.7475 2.7551 6.5093 7.6621 5.2049 1.4549 2.4236 2.7547 2.2010 1.4699 1.3947 2.0815 2.4877 5.6361 1.3548 1.9733 1.7986 1.9552 2.0389 2.5641 2.0437 1.6249 1.2587 1.8532 3.7389 1.6515 2.4410 1.5043 1.3455 1.1757 1.3767 1.5239 1.3109 10.0055 1.2283 5.3161 2.5440 1.1502 1.1341 1.4234 1.0741 2.2568 1.1168 2.3278 6.5714 5.5141 5.8433 1.0387 1.0595 1.0837 1.0923 1.0665 1.0970 1.1001 1.0908 1.1119 1.0934 1.0912 1.0962 1.0774 1.0770
irintensity: 2.2242 0.3027 0.6700 2.3107 1.2945 20.4727 8.6080 0.8286 1.5997 4.8903 2.1938 9.2335 0.1975 0.5280 0.4166 1.4359 27.4929 5.9204 10.9570 3.2439 2.6321 5.3932 3.5696 5.0712 16.2491 219.1487 32.0757 15.6136 6.9901 20.8554 23.6981 15.5106 27.2468 10.6553 42.1389 13.4221 1.2723 1.0394 18.1014 1.3585 16.2084 5.5969 0.1534 2.3958 12.0224 6.0087 13.9910 27.0932 46.1206 16.0074 4.0690 42.8940 8.5486 188.7946 165.9044 52.9982 177.1720 2.4790 23.0186 83.7415 11.0479 2.3931 111.8958 20.2350 1.1061 23.9134 19.2205 30.1076 38.6856 9.7995 43.1380 4.2638 654.1169 4.6060 103.2658 51.5441 17.0816 46.0754 3.4391 5.6823 21.9924 27.4694 29.3665 2.8674 15.0752 10.7503 1.2643 2.8604 12.0248 29.3666
temp: 298.150 k
press: 1.00000 atm
elementType: 17 8 8 8 7 7 7 6 6 6 6 6 6 6 6 6 6 6 1 1 1 1 1 1 1 1 1 1 1 1 1 1
symmnumber: 1
zpe: 645129.7 jmol-1
zpe.correction: 0.245717 hartree
zpe.thermalcorrener: 0.263911 hartree
zpe.thermalcorrenthalpy: 0.264855 hartree
zpe.thermalcorrgfe: 0.194906 hartree
zpe.sumelectzpe: -1276.157059 hartree
zpe.sumelectthermal: -1276.138864 hartree
zpe.sumelectthermalent: -1276.137920 hartree
zpe.sumelectthermalfe: -1276.207869 hartree
dipole: 4.3821 1.0033 0.6273
dipole: 4.5390
quadrupole: -146.3394 -107.8008 -116.2847
quadrupole: -3.7587 -7.0674 -5.4621
quadrupole: -22.8644 15.6742 7.1902 -3.7587 -7.0674 -5.4621
hfenergy: -1276.4027755 hartree
pointgroup: C01 [X(C11H14Cl1N3O3)]
dipole: 1.7225055 -0.368921 0.2930434 debye
polarizability: 218.7748546|-12.1418347|132.6363623|1.0250145|-27.1597435|140.8290796 unknown
InChI: InChI=1S/C11H14ClN3O3/c1-8(14-11(16)13-6-5-12)9-3-2-4-10(7-9)15(17)18/h2-4,7-8,13-14H,5-6H2,1H3
charge 0 multiplicity 1
32 atoms
Cl 6.200982 1.712246 0.410956
O  2.32531 -1.773027 0.278064
O  -5.492211 0.758965 0.557403
O  -4.469535 1.511348 -1.335743
N  1.351788 0.122894 -0.694152
N  3.296949 0.332668 0.61151
N  -4.483583 0.815129 -0.246829
C  0.260874 -0.638318 -1.34711
C  -0.999654 -0.652556 -0.461753
C  0.036327 -0.107771 -2.775074
C  -2.164438 0.078024 -0.780011
C  -0.978539 -1.421305 0.736492
C  -3.267744 0.036096 0.100518
C  2.324336 -0.513444 0.076678
C  -2.095254 -1.453487 1.5995
C  -3.260107 -0.71907 1.291081
C  4.391533 -0.195297 1.425586
C  5.751364 -0.110165 0.731139
H  0.638625 -1.67599 -1.399915
H  -0.25339 0.960269 -2.782808
H  0.966874 -0.209844 -3.358197
H  -0.759384 -0.677339 -3.286319
H  1.291468 1.142983 -0.710473
H  -2.248094 0.67529 -1.69152
H  -0.072111 -1.989447 0.977958
H  -2.060634 -2.055507 2.513177
H  -4.14214 -0.72296 1.936512
H  3.353814 1.313586 0.331006
H  4.437282 0.327286 2.39959
H  4.159217 -1.261002 1.613172
H  5.748739 -0.58507 -0.260248
H  6.565238 -0.498385 1.361314
