program: Gaussian 09
title: 000299752
version: EM64L-G09RevD.01
frameworkgroup: C1[X(C14H18O)]
method: RPBEPBE
basis: SDD
operation: Freq
keyword: #pfreq=noraman
keyword: PBEPBE/SDD
title: #p freq=noraman PBEPBE/SDD
converged: YES YES NO NO
title: Mulliken charges:
elementType: O C C C C C C C C C C C C C C H H H H H H H H H H H H H H H H H H
charge: -0.218535 0.012993 -0.487887 -0.486796 -0.430199 -0.431548 -0.439359 -0.540158 0.118448 0.281289 -0.343724 -0.347917 -0.248643 -0.230833 -0.225059 0.198203 0.196941 0.224465 0.219507 0.196098 0.204733 0.215778 0.212810 0.206755 0.212214 0.228583 0.232920 0.249022 0.246423 0.277820 0.229732 0.232952 0.232971
chargesum: 0.00000
title: Mulliken charges with hydrogens summed into heavy atoms:
elementType: O C C C C C C C C C C C C C C
charge: -0.218535 0.211196 -0.066480 -0.071190 -0.009688 -0.011983 0.001438 -0.058216 0.118448 0.281289 -0.097301 -0.070098 -0.018911 0.002118 0.007912
polarizability: 2.04424147e+02 9.03053761e+00 1.50374317e+02 2.40954643e+00 -5.68543023e+00 9.13698778e+01
1716.lowfreq: -46.1888 -9.5561 -0.0007 -0.0001 0.0009 3.7700 17.4258 26.4488 30.7445
frequency: -39.1157 25.4347 30.6705 55.5918 62.3330 111.1629 148.3674 160.4883 196.9728 204.7749 290.1429 386.5513 400.9111 413.4315 422.4067 488.5213 540.9415 567.8112 614.1504 617.2442 652.3517 697.2017 740.9690 756.4479 783.7300 793.6637 811.1715 858.4153 862.4696 888.4453 923.3413 945.4254 951.0083 964.7623 977.6292 989.9604 990.6450 1004.4228 1011.8319 1026.0894 1051.5118 1070.5660 1085.2634 1095.8396 1107.8422 1128.6474 1172.4429 1173.9211 1185.0135 1186.5324 1204.4799 1220.1778 1225.9213 1262.1099 1268.7273 1280.7337 1293.5681 1299.0734 1301.9366 1311.6041 1318.0691 1344.0597 1359.3485 1387.3193 1429.6909 1436.5655 1461.1050 1462.3122 1472.0470 1473.3205 1478.7827 1491.2236 1570.7166 1599.1687 1613.0424 2940.4947 2956.5967 2970.2646 2978.8221 2988.2490 2991.2426 3004.6321 3007.9482 3033.3349 3044.7042 3050.5446 3053.0381 3074.7908 3127.3498 3137.4083 3149.1317 3158.0553 3168.3804
redmass: 1.9268 2.4777 3.2846 4.1542 4.0677 2.4764 2.8923 3.5911 2.6960 4.5919 4.8770 3.5282 2.8184 3.0142 2.4733 4.0935 3.1930 2.2253 6.3925 2.6902 5.2110 1.8205 1.5122 1.4411 2.2308 1.8583 1.6949 1.3110 2.7874 2.4143 1.6682 1.6191 1.9073 1.4190 2.9856 6.2539 1.3780 1.5128 1.3991 2.1244 2.8959 2.3781 1.6575 1.9782 2.4473 1.4136 1.0756 1.4761 1.3652 1.1348 1.6317 1.6083 1.3278 1.3176 1.2697 1.2958 1.2397 1.3676 1.3405 1.3864 1.4327 1.5714 1.7868 9.4266 1.1493 2.0790 1.0863 1.0839 1.0835 1.0865 2.2019 1.0991 6.8272 6.8179 6.6033 1.0825 1.0607 1.0620 1.0622 1.0609 1.0617 1.0956 1.0667 1.0981 1.0996 1.1029 1.1019 1.1046 1.0850 1.0880 1.0922 1.0959 1.1012
irintensity: 0.1357 0.3154 0.0300 0.7120 2.1961 1.6990 0.2245 0.4249 1.7099 1.8650 7.1498 0.1128 0.0660 0.4407 1.5910 7.0116 8.4127 5.3665 0.2389 0.5573 8.2350 48.0514 17.9491 53.5581 0.9250 2.9585 2.2637 0.6853 0.7637 4.4365 3.7885 2.2819 6.4573 11.7450 38.4964 3.2901 0.4768 1.2097 1.1482 1.6388 0.1391 1.8668 7.8217 0.3428 2.0330 0.2932 4.0360 1.3128 0.9423 28.1986 38.9974 16.3384 21.0863 37.7306 17.1518 31.0498 6.2048 8.0961 13.4174 5.6399 21.7923 32.2339 16.5253 2.4139 9.2824 25.2631 1.0668 6.3888 6.4171 16.3079 0.3662 2.9085 86.7754 40.4199 12.0333 14.7373 22.8569 35.8051 32.8963 38.1628 36.3043 4.6063 61.4435 43.0167 7.1159 15.3665 34.7933 122.2151 0.1863 6.5703 17.9533 23.9305 21.3531
temp: 298.150 k
press: 1.00000 atm
elementType: 8 6 6 6 6 6 6 6 6 6 6 6 6 6 6 1 1 1 1 1 1 1 1 1 1 1 1 1 1 1 1 1 1
symmnumber: 1
zpe: 741837.6 jmol-1
zpe.correction: 0.282551 hartree
zpe.thermalcorrener: 0.296152 hartree
zpe.thermalcorrenthalpy: 0.297096 hartree
zpe.thermalcorrgfe: 0.239813 hartree
zpe.sumelectzpe: -618.391720 hartree
zpe.sumelectthermal: -618.378119 hartree
zpe.sumelectthermalent: -618.377175 hartree
zpe.sumelectthermalfe: -618.434459 hartree
dipole: 0.6718 3.0964 -0.5077
dipole: 3.2089
quadrupole: -77.9807 -93.4840 -92.2859
quadrupole: 3.7176 0.0859 -0.6976
quadrupole: 9.9362 -5.5671 -4.3691 3.7176 0.0859 -0.6976
hfenergy: -618.6742714 hartree
pointgroup: C01 [X(C14H18O1)]
dipole: -0.2683024 -1.2204166 -0.1801514 debye
polarizability: 204.4914172|8.7984401|150.482991|-2.4035741|4.7381216|91.1939332 unknown
InChI: InChI=1S/C14H18O/c15-14(13-8-2-1-3-9-13)11-10-12-6-4-5-7-12/h1-3,8-9,12H,4-7,10-11H2
charge 0 multiplicity 1
33 atoms
O  -0.826964 2.163576 0.197999
C  2.9409 0.065622 -0.383583
C  4.251711 0.89426 -0.335422
C  3.232014 -1.06512 0.642033
C  5.388172 -0.161732 -0.232966
C  4.734439 -1.423252 0.434863
C  1.674592 0.899454 -0.099478
C  0.376327 0.07351 -0.166943
C  -0.892373 0.910997 0.020806
C  -2.229752 0.217064 -0.008528
C  -2.360868 -1.184119 -0.207973
C  -3.402172 1.001338 0.170009
C  -3.637412 -1.786219 -0.22802
C  -4.676006 0.400587 0.150418
C  -4.797139 -0.99645 -0.048838
H  2.85246 -0.391328 -1.394429
H  4.236269 1.534699 0.569605
H  4.366819 1.56282 -1.208105
H  2.573142 -1.944711 0.521397
H  3.067208 -0.667047 1.664288
H  6.248654 0.216709 0.347295
H  5.767164 -0.415555 -1.2404
H  4.83519 -2.303786 -0.226429
H  5.222299 -1.685752 1.390924
H  1.757537 1.368554 0.900846
H  1.603007 1.737476 -0.818826
H  0.308122 -0.453051 -1.142796
H  0.386556 -0.725772 0.602068
H  -1.472333 -1.808517 -0.348092
H  -3.280225 2.079171 0.321517
H  -3.730141 -2.866918 -0.382138
H  -5.573285 1.013597 0.289105
H  -5.78741 -1.465504 -0.064209
