program: Gaussian 09
title: 000299756
version: EM64L-G09RevD.01
frameworkgroup: C1[X(C14H9N5O)]
method: RPBEPBE
basis: SDD
operation: Freq
keyword: #p
keyword: freq=noraman
keyword: PBEPBE/SDD
title: #p freq=noraman PBEPBE/SDD
converged: YES YES NO NO
title: Mulliken charges:
elementType: O N N N N N C C C C C C C C C C C C C C H H H H H H H H H
charge: -0.197968 -0.014312 0.042246 0.052641 0.051197 0.047275 -0.356186 0.182783 0.228635 0.505773 -0.621618 -0.214115 -0.219666 -0.350330 -0.397727 -0.153269 -0.174952 -0.220809 -0.224238 -0.228988 0.288843 0.269891 0.244757 0.248006 0.271122 0.233401 0.235704 0.234925 0.236979
chargesum: 0.00000
title: Mulliken charges with hydrogens summed into heavy atoms:
elementType: O N N N N N C C C C C C C C C C C C C C
charge: -0.197968 -0.014312 0.042246 0.052641 0.051197 0.047275 -0.067342 0.182783 0.228635 0.505773 0.141036 -0.214115 -0.219666 -0.079208 -0.164326 -0.153269 -0.174952 0.014895 0.010688 0.007991
polarizability: 2.14624688e+02 1.54930026e+01 1.60466446e+02 5.44785724e+00 -8.20876686e+00 1.40817972e+02
1716.lowfreq: -4.5389 -0.0007 -0.0003 0.0004 2.5916 10.7142 24.3941 41.7342 68.9227
frequency: 24.0635 41.6807 68.9187 80.9811 110.0739 118.7005 119.5835 131.8953 139.2810 160.7672 183.0604 188.1716 207.8924 238.3260 271.4499 291.5226 308.3445 384.6196 400.6949 418.2913 436.2927 443.5460 447.5788 465.3090 484.6440 498.4545 522.0811 556.5250 570.7766 573.8645 602.0368 615.2769 639.7706 688.9810 704.6391 768.1747 788.9537 836.5459 856.7065 862.0175 934.5020 963.3717 979.4467 985.7524 990.9853 1005.9236 1028.1987 1031.4753 1063.1072 1078.9038 1094.4258 1116.6991 1159.8491 1178.2476 1193.3562 1198.6726 1212.7964 1231.7630 1320.4541 1354.8603 1388.9606 1421.1876 1446.3930 1457.4105 1473.9171 1485.4363 1594.8322 1613.5376 2185.6705 2190.6108 2203.0165 2206.1840 2971.4160 3056.8885 3081.7772 3115.2060 3129.5598 3136.9940 3150.6690 3164.7759 3175.7234
redmass: 6.3628 4.9399 6.0427 9.9003 11.9384 10.0617 10.2953 9.2947 5.8650 4.3383 1.3494 5.1194 3.4678 5.9154 7.0767 5.7973 4.8205 7.3864 2.8416 10.4005 10.2756 7.9638 10.0265 7.3819 10.8223 6.8577 6.1339 7.4418 12.2688 12.0940 5.9842 6.4514 6.5008 5.8061 1.6953 2.7912 4.0301 4.8450 1.2499 7.4040 1.4181 4.5561 8.2017 1.4355 5.8875 1.3368 3.3468 2.5149 3.2611 5.2671 1.6957 1.5469 5.3391 1.0590 2.3527 1.1376 2.3124 1.4719 1.5475 1.4910 5.2173 1.1617 2.1059 1.0517 1.0529 2.2412 6.0072 5.9299 12.6646 12.6660 12.6573 12.6587 1.0405 1.0866 1.0934 1.0894 1.1011 1.0868 1.0921 1.0964 1.0996
irintensity: 0.0129 0.2386 0.8313 0.2673 0.8042 2.1259 1.9361 5.3070 0.2003 1.2170 2.0824 1.8616 4.1900 3.8335 0.9814 8.2956 1.4258 6.6825 0.2369 0.7082 0.2510 0.9600 0.0811 3.4726 1.1026 8.1866 9.8975 11.2709 0.5495 3.7242 53.8312 0.0306 0.5089 21.9688 74.7563 34.5591 15.4204 2.8694 0.4043 5.1386 0.3494 6.7049 8.2883 0.5138 1.9745 0.1211 31.4934 2.2919 3.7392 7.1002 8.1855 10.5857 3.8507 0.3056 2.3811 6.4628 28.8957 0.1179 11.5314 2.0674 1.0265 9.2955 9.8270 21.6889 19.8309 10.0848 1.2098 0.2724 3.5306 3.6524 0.7893 2.9871 21.4335 4.0776 13.7113 7.8660 3.6627 1.0553 16.0706 15.9304 11.6591
temp: 298.150 k
press: 1.00000 atm
elementType: 8 7 7 7 7 7 6 6 6 6 6 6 6 6 6 6 6 6 6 6 1 1 1 1 1 1 1 1 1
symmnumber: 1
zpe: 520515.8 jmol-1
zpe.correction: 0.198254 hartree
zpe.thermalcorrener: 0.216804 hartree
zpe.thermalcorrenthalpy: 0.217748 hartree
zpe.thermalcorrgfe: 0.151322 hartree
zpe.sumelectzpe: -886.312227 hartree
zpe.sumelectthermal: -886.293677 hartree
zpe.sumelectthermalent: -886.292733 hartree
zpe.sumelectthermalfe: -886.359159 hartree
dipole: 3.5202 -3.9642 -2.8686
dipole: 6.0279
quadrupole: -120.4423 -120.0130 -123.1297
quadrupole: 0.2310 4.8345 -0.2142
quadrupole: 0.7527 1.1820 -1.9347 0.2310 4.8345 -0.2142
hfenergy: -886.510481 hartree
pointgroup: C01 [X(C14H9N5O1)]
dipole: -1.820588 -1.4500203 -0.4551653 debye
polarizability: 202.3771957|-26.2860212|148.0034989|-14.4434061|11.3308593|165.5284121 unknown
InChI: InChI=1S/C14H9N5O/c1-19-12(11-5-3-2-4-6-11)13(7-15,8-16)14(9-17,10-18)20-19/h2-6,12H,1H3
charge 0 multiplicity 1
29 atoms
O  0.703518 -1.493237 1.154812
N  -0.046573 -2.08017 0.051199
N  2.037972 -0.250382 -2.95244
N  -0.232577 2.672298 -0.780942
N  1.199605 1.556385 2.592706
N  4.003714 -0.857617 0.237588
C  -0.616648 -0.940877 -0.677398
C  0.642964 0.158251 -0.713995
C  1.449681 -0.208308 0.618487
C  -1.883308 -0.357173 -0.070929
C  0.770419 -3.064092 -0.708853
C  1.442999 -0.065716 -1.935592
C  0.160089 1.548245 -0.729994
C  -2.151238 -0.399512 1.320248
C  -2.825232 0.24271 -0.944515
C  1.314009 0.7822 1.694307
C  2.862132 -0.545863 0.390168
C  -3.345927 0.157539 1.824315
C  -4.016926 0.802771 -0.436964
C  -4.278866 0.763392 0.951267
H  -0.805384 -1.238965 -1.723364
H  1.163254 -3.796913 0.011291
H  1.613258 -2.621519 -1.275848
H  0.093954 -3.585866 -1.406487
H  -1.438691 -0.876013 1.99964
H  -2.630625 0.275158 -2.024221
H  -3.546479 0.121662 2.90031
H  -4.735753 1.265956 -1.120873
H  -5.201941 1.198855 1.348876
