program: Gaussian 09
title: 000299798
version: EM64L-G09RevD.01
frameworkgroup: C1[X(C22H26N2O3)]
method: RPBEPBE
basis: SDD
operation: Freq
keyword: #p
keyword: freq=noraman
keyword: PBEPBE/SDD
title: #p freq=noraman PBEPBE/SDD
converged: YES YES NO NO
title: Mulliken charges:
elementType: O O O N N C C C C C C C C C C C C C C C C C C C C C C H H H H H H H H H H H H H H H H H H H H H H H H H H
charge: -0.261683 -0.270876 -0.278891 -0.348999 -0.362005 -0.168694 -0.396503 -0.143940 -0.038999 0.091289 0.141733 -0.603943 -0.718104 -0.698335 0.474759 -0.408632 -0.408728 -0.387407 -0.348855 0.360154 -0.416264 0.429586 -0.423499 -0.382162 -0.223291 -0.218631 -0.238931 0.243957 0.212768 0.239956 0.261982 0.208851 0.336360 0.230190 0.261500 0.349093 0.195056 0.223437 0.226778 0.204431 0.228794 0.214547 0.251140 0.237435 0.254227 0.250417 0.222203 0.223050 0.228756 0.259837 0.227605 0.227730 0.229749
chargesum: 0.00000
title: Mulliken charges with hydrogens summed into heavy atoms:
elementType: O O O N N C C C C C C C C C C C C C C C C C C C C C C
charge: -0.261683 -0.270876 -0.278891 -0.012638 -0.012912 0.075263 0.056222 0.118042 0.169852 0.091289 0.141733 -0.112253 -0.072833 -0.050563 0.474759 -0.157492 -0.171293 -0.133181 -0.098438 0.360154 0.028989 0.429586 -0.194743 -0.122326 0.004315 0.009099 -0.009182
polarizability: 3.71875655e+02 -1.53264818e+01 2.22365100e+02 1.07483144e+01 3.54696020e+01 1.96986179e+02
1716.lowfreq: -6.4302 -0.0006 0.0005 0.0015 1.9115 3.6371 10.8780 14.4647 14.7738
frequency: 9.4718 14.0637 14.3737 21.4885 32.4605 41.6034 46.6171 64.5162 71.2323 102.9063 103.5378 113.5734 144.7569 153.0147 173.5133 194.1952 208.5478 229.4784 246.6781 278.2296 286.5665 301.1207 315.4371 346.4471 362.1653 394.1849 402.3075 405.6308 412.0560 414.5212 444.6633 448.2121 462.9803 487.4587 494.6547 537.2918 543.1732 578.7808 599.1016 614.0655 618.9693 631.4574 635.6360 695.4677 702.1435 723.1263 730.1775 739.8808 745.5281 756.0513 789.7499 801.6702 812.3085 823.9205 833.7711 845.5854 855.4394 874.1501 903.2002 913.4711 919.2938 933.1812 941.6982 951.7376 965.6538 966.5560 975.1636 979.1719 990.0065 996.4936 1003.2183 1007.0905 1013.5316 1024.2762 1028.1206 1055.9576 1086.1861 1094.2414 1116.0168 1120.4761 1137.6050 1172.9226 1179.1565 1186.8287 1194.5357 1198.5143 1203.3593 1213.6919 1224.1327 1230.1453 1231.7795 1239.2323 1252.2193 1285.1653 1300.5272 1309.5278 1312.2593 1316.1910 1319.5326 1333.2442 1352.2629 1355.7670 1366.2127 1379.6492 1380.9557 1391.2041 1394.0706 1398.2079 1415.7331 1419.2588 1435.8499 1441.0639 1444.3373 1464.8194 1466.6918 1471.2385 1480.6014 1483.8220 1486.6717 1498.6545 1501.9306 1580.4227 1596.6641 1618.9087 1622.1771 1623.9163 1629.5991 2931.9055 2936.7343 2959.2891 2964.4046 2975.4581 2983.6375 2998.1464 3012.1010 3027.0010 3047.2929 3050.0589 3066.0437 3072.1251 3077.9142 3080.1038 3114.2090 3118.3649 3121.2564 3128.6398 3142.1601 3158.3227 3161.7271 3166.8378 3170.3617 3479.3204 3516.3959
redmass: 3.9462 4.3734 4.8636 3.9834 4.5840 4.3974 5.1111 4.7030 4.7169 4.2586 4.8712 3.3604 5.0069 5.9854 4.2812 4.7235 3.2770 1.1694 3.7245 3.8543 1.0591 5.4186 2.7747 3.2352 2.2198 3.6818 2.8222 2.3878 3.1368 3.8027 3.4024 7.8168 4.2546 3.6630 4.3436 2.9692 3.1680 3.8830 3.0023 4.7852 5.2954 3.6528 4.0566 1.6913 2.1545 3.1175 1.6537 1.8936 2.7359 3.4383 3.5193 3.4022 2.0457 2.0182 2.3531 2.4799 1.2540 2.1239 1.8326 1.3395 1.4705 2.2541 1.4724 1.8156 1.3654 1.7604 6.5202 1.4284 6.1329 1.3411 2.7456 2.3352 1.7377 2.4562 2.1415 2.7533 1.5620 2.0371 1.5424 1.6541 1.6924 1.0538 1.2620 1.1091 1.9519 1.3948 1.2211 1.9394 2.5412 2.8010 1.2760 1.3562 1.2871 1.6938 1.4149 1.4265 1.4850 1.3968 1.4115 1.5362 1.3953 1.6787 1.6674 1.2250 4.9227 3.7413 2.2599 1.5534 1.7985 2.5187 2.6414 2.1468 1.0863 1.0476 1.1072 1.1539 1.0545 1.0513 2.3271 1.0636 2.3694 6.9298 6.2041 6.1036 6.4093 5.9413 6.1956 1.0814 1.0575 1.0511 1.0643 1.0367 1.0655 1.1031 1.0610 1.0843 1.1008 1.0970 1.0981 1.0999 1.1022 1.0999 1.0878 1.0898 1.0897 1.0867 1.0926 1.0966 1.0936 1.0949 1.0991 1.0759 1.0756
irintensity: 0.1804 0.1618 1.1004 0.1196 0.0978 0.7014 0.1884 0.2664 0.8992 4.0683 0.5777 1.1097 1.7544 2.4710 2.8695 1.2650 3.4361 0.0796 1.6341 3.6069 0.1264 0.9747 0.0860 5.1994 1.7701 10.9922 0.7374 1.5762 4.6242 18.9501 3.8431 0.0933 0.4068 8.1454 8.1218 11.8469 16.0352 11.6381 7.8407 6.8920 6.7386 20.9490 19.6886 32.0782 31.8302 4.1449 135.0932 83.3242 15.4281 9.3887 0.4147 7.1691 18.9142 4.1237 19.3797 19.2764 0.3254 45.0592 12.7915 4.3485 0.6209 3.2871 1.2900 0.6415 0.5527 1.0470 96.3874 4.2553 0.1968 0.5478 6.7114 9.4100 1.9515 26.3595 7.5130 33.7793 7.6089 11.4107 13.4991 15.9398 6.1868 0.4817 109.6689 4.7804 6.7930 31.1545 3.4385 41.5138 131.9400 201.2464 5.3074 75.7739 4.8167 4.0036 54.6223 11.1393 3.4432 6.1797 18.2372 2.7940 35.0180 14.0260 4.9001 19.9472 9.2386 12.8222 221.5110 41.5777 14.4861 4.1554 0.8192 14.7929 5.7219 3.0747 13.8641 61.1015 6.2362 24.1242 2.5732 25.3188 146.7217 10.4516 0.9420 10.5590 66.5967 260.0769 403.4903 17.8969 27.4999 14.5914 25.4787 28.8190 21.6147 29.6333 13.5830 6.5791 17.1937 44.1055 73.1200 47.7908 9.7156 40.8897 9.8191 10.7525 23.7443 0.6558 26.7401 35.1232 14.2468 3.7947 10.6613 73.5779 26.4719
temp: 298.150 k
press: 1.00000 atm
elementType: 8 8 8 7 7 6 6 6 6 6 6 6 6 6 6 6 6 6 6 6 6 6 6 6 6 6 6 1 1 1 1 1 1 1 1 1 1 1 1 1 1 1 1 1 1 1 1 1 1 1 1 1 1
symmnumber: 1
zpe: 1146715.9 jmol-1
zpe.correction: 0.436761 hartree
zpe.thermalcorrener: 0.462647 hartree
zpe.thermalcorrenthalpy: 0.463591 hartree
zpe.thermalcorrgfe: 0.375017 hartree
zpe.sumelectzpe: -1187.154587 hartree
zpe.sumelectthermal: -1187.128701 hartree
zpe.sumelectthermalent: -1187.127757 hartree
zpe.sumelectthermalfe: -1187.216330 hartree
dipole: -0.5667 0.5277 -2.8238
dipole: 2.9280
quadrupole: -130.3632 -178.5259 -156.7111
quadrupole: 6.1072 2.4507 -2.5176
quadrupole: 24.8369 -23.3258 -1.5110 6.1072 2.4507 -2.5176
hfenergy: -1187.5913476 hartree
pointgroup: C01 [X(C22H26N2O3)]
dipole: -0.2948903 -0.5035571 0.9932181 debye
polarizability: 373.2106255|7.8844811|199.7131023|3.2227214|37.319226|218.3032062 unknown
InChI: InChI=1S/C22H26N2O3/c1-15(2)12-19-21(25)24-20(22(26)23-19)13-16-8-10-18(11-9-16)27-14-17-6-4-3-5-7-17/h3-11,15,19-20,23-24H,12-14H2,1-2H3
charge 0 multiplicity 1
53 atoms
O  3.333629 -1.869973 -1.792115
O  4.109503 2.423489 1.526916
O  -3.923499 0.534839 -0.49215
N  4.94139 0.558641 0.426528
N  2.45435 -0.117868 -0.546833
C  4.826308 -0.774132 -0.206439
C  5.055677 -1.955584 0.792594
C  2.482464 0.896635 0.522056
C  6.53772 -2.347606 1.059696
C  3.476561 -0.960227 -0.92031
C  3.910457 1.360211 0.862955
C  1.592366 2.117634 0.139917
C  7.398388 -1.194241 1.633144
C  7.205967 -2.964762 -0.192897
C  0.127672 1.735489 -0.004712
C  -0.456185 1.508062 -1.281319
C  -0.691732 1.561099 1.137738
C  -1.80134 1.112648 -1.412328
C  -2.042889 1.165522 1.028519
C  -2.598659 0.932547 -0.255574
C  -4.781697 0.294919 0.681244
C  -6.121084 -0.231609 0.204529
C  -7.28821 0.046399 0.95775
C  -6.220189 -1.03952 -0.954575
C  -8.537111 -0.487659 0.568054
C  -7.470348 -1.565683 -1.349312
C  -8.631522 -1.29644 -0.587735
H  5.584522 -0.840848 -1.008359
H  4.557123 -1.696969 1.747975
H  4.539919 -2.842076 0.376343
H  2.065071 0.467406 1.460437
H  6.496109 -3.140623 1.836122
H  5.876739 0.872427 0.701882
H  1.981521 2.549403 -0.800348
H  1.740118 2.870756 0.933461
H  1.549365 -0.27562 -1.005206
H  7.620471 -0.428597 0.862524
H  8.375003 -1.577549 1.981507
H  6.904061 -0.698125 2.489105
H  7.297334 -2.228429 -1.014064
H  6.623002 -3.821133 -0.577327
H  8.225863 -3.319811 0.04375
H  0.145354 1.662043 -2.186032
H  -0.273077 1.750541 2.13427
H  -2.253013 0.942747 -2.394328
H  -2.643835 1.054507 1.935743
H  -4.282446 -0.447598 1.341303
H  -4.91137 1.236003 1.253807
H  -7.224773 0.68389 1.848885
H  -5.320877 -1.233973 -1.546825
H  -9.43317 -0.266006 1.158434
H  -7.538885 -2.185416 -2.250463
H  -9.599915 -1.707076 -0.894632
