program: Gaussian 09
title: 000299748
version: EM64L-G09RevD.01
frameworkgroup: C1[X(C14H21N3O2)]
method: RPBEPBE
basis: SDD
operation: Freq
keyword: #p
keyword: freq=noraman
keyword: PBEPBE/SDD
title: #p freq=noraman PBEPBE/SDD
converged: YES YES NO NO
title: Mulliken charges:
elementType: O O N N N C C C C C C C C C C C C C C H H H H H H H H H H H H H H H H H H H H H
charge: -0.289318 -0.267942 -0.096341 -0.077220 -0.128376 -0.348125 -0.289187 -0.619538 -0.617761 0.215418 0.187142 -0.339003 -0.340601 0.240321 -0.368447 -0.349839 -0.145402 -0.627989 -0.589413 0.195290 0.249846 0.240769 0.217612 0.235523 0.188294 0.220366 0.226684 0.190837 0.220569 0.266188 0.264869 0.248979 0.231991 0.220512 0.223422 0.292948 0.225829 0.231967 0.225938 0.233186
chargesum: 0.00000
title: Mulliken charges with hydrogens summed into heavy atoms:
elementType: O O N N N C C C C C C C C C C C C C C
charge: -0.289318 -0.267942 -0.096341 -0.077220 -0.128376 0.097011 0.169195 0.024645 0.020329 0.215418 0.187142 -0.072815 -0.075732 0.240321 -0.119468 -0.117847 0.075110 0.114211 0.101678
polarizability: 3.66611995e+02 -2.63561492e+01 1.67764719e+02 9.58200257e+00 1.17853010e+01 1.15560164e+02
1716.lowfreq: -1.8310 -0.0008 0.0003 0.0004 3.4578 7.7426 23.4788 29.0370 34.0854
frequency: 23.2615 28.8409 33.9204 48.0161 57.2452 63.7681 76.0408 84.7224 93.6066 129.0999 146.4540 148.3300 176.4854 205.8378 223.4794 224.5471 238.1649 277.9387 283.3260 315.8965 346.9595 351.6899 375.8106 383.8830 412.9054 416.8469 436.7938 454.0331 515.8892 519.5805 536.6306 630.9407 657.9557 681.3773 744.5296 761.0663 801.7305 827.2023 828.8112 834.2481 859.3146 882.1943 918.0407 950.0260 974.4972 992.6535 1000.0352 1029.1515 1038.7529 1045.4679 1058.5447 1061.7009 1080.5393 1087.6778 1091.9669 1095.4613 1111.8969 1139.0481 1143.6356 1171.6107 1190.0374 1213.4946 1241.4756 1250.9332 1264.2407 1270.9604 1294.3339 1294.7861 1332.1901 1357.8674 1373.4360 1380.0887 1408.5537 1415.1970 1422.1079 1429.3269 1441.3664 1442.0521 1450.7866 1459.7316 1461.7881 1471.3379 1472.1027 1475.3484 1484.8497 1485.4216 1488.0481 1493.4838 1512.8936 1552.8617 1603.2231 1613.1486 1649.8298 2850.3705 2860.2893 2887.8069 2957.3086 2965.9786 2991.8469 3019.3985 3023.1129 3029.2490 3040.2191 3041.5434 3059.6614 3078.8612 3082.9774 3089.6333 3113.0105 3117.7606 3126.5197 3146.3233 3166.6320 3171.2458
redmass: 4.4023 3.0152 2.7929 3.3174 4.3836 3.3810 2.7399 1.7225 2.7359 1.6495 3.0373 2.9345 2.7649 2.7530 1.0703 1.9544 1.4465 3.2117 4.8428 4.2316 2.7950 2.9732 3.6526 2.9978 2.6281 2.9720 3.0910 4.4609 3.8964 4.2117 3.9539 7.1046 5.8041 4.1147 3.2901 4.6392 1.9864 4.3516 2.6678 1.3969 1.6919 3.6573 7.1077 1.4917 1.3555 1.3533 3.1721 2.4880 1.5727 3.4014 1.3748 1.9536 2.5371 1.8601 1.3098 1.2274 1.3504 1.4592 1.3738 1.2068 1.6364 2.8058 3.3915 3.5708 1.7912 2.1473 1.2557 1.2557 1.3550 4.4707 1.4356 1.3310 2.6922 1.1751 1.1402 3.7726 1.1374 1.2198 1.1174 1.0438 1.0505 1.0539 1.1187 1.0562 1.0463 1.0815 1.0619 1.6204 1.7558 7.4496 6.5934 8.6294 6.2504 1.0569 1.0580 1.0692 1.0356 1.0359 1.0870 1.0733 1.0723 1.1012 1.0574 1.1016 1.0900 1.1004 1.1003 1.0981 1.0980 1.1092 1.0891 1.0879 1.0959 1.0958
irintensity: 0.9714 0.0771 0.0422 0.8578 0.6896 0.8888 0.4814 0.5501 0.9632 1.4612 2.7263 0.1610 1.4830 0.5155 0.7035 1.4161 0.4579 13.5451 2.7160 14.8633 12.4007 23.8751 10.5497 2.1906 3.5240 0.2914 3.5852 12.9216 4.8108 5.5534 5.1178 0.9443 0.7346 31.7998 13.8327 11.6011 6.7717 7.0555 4.1541 10.6526 40.7751 12.9447 44.7181 67.3855 1.1791 0.4785 52.8489 4.5023 47.6907 490.3717 7.5969 5.1420 7.9125 357.8205 11.4654 1.7720 8.1956 8.0572 0.5546 168.9508 31.0168 3.8310 10.4488 471.4658 6.3873 10.7534 1.8294 0.1055 30.8699 12.4941 100.4035 14.1216 10.2699 26.0405 3.4258 4.7481 0.6655 41.4439 29.4423 8.8991 10.1342 9.3552 17.8896 33.6063 25.9375 12.9806 9.1183 14.8381 70.5007 17.5110 1353.4486 61.9251 450.1053 71.4444 171.1156 111.9094 94.2990 155.1750 49.2936 39.7737 49.2350 43.8570 51.1871 31.9306 3.2701 23.5636 56.9289 25.5774 1.1370 17.7842 15.4039 1.8982 13.5027 0.8076
temp: 298.150 k
press: 1.00000 atm
elementType: 8 8 7 7 7 6 6 6 6 6 6 6 6 6 6 6 6 6 6 1 1 1 1 1 1 1 1 1 1 1 1 1 1 1 1 1 1 1 1 1
symmnumber: 1
zpe: 871163.3 jmol-1
zpe.correction: 0.331809 hartree
zpe.thermalcorrener: 0.352939 hartree
zpe.thermalcorrenthalpy: 0.353883 hartree
zpe.thermalcorrgfe: 0.279062 hartree
zpe.sumelectzpe: -859.313900 hartree
zpe.sumelectthermal: -859.292769 hartree
zpe.sumelectthermalent: -859.291825 hartree
zpe.sumelectthermalfe: -859.366647 hartree
dipole: 5.0306 -4.8653 1.0638
dipole: 7.0788
quadrupole: -66.8351 -112.0229 -115.0854
quadrupole: -3.3785 0.7900 1.0079
quadrupole: 31.1460 -14.0418 -17.1042 -3.3785 0.7900 1.0079
hfenergy: -859.6457085 hartree
pointgroup: C01 [X(C14H21N3O2)]
dipole: 1.9749069 -1.8332581 -0.70366 debye
polarizability: 366.3137293|-29.360577|140.7025647|-3.5390088|28.2473651|142.9205841 unknown
InChI: InChI=1S/C14H21N3O2/c1-16(2)9-10-19-14(18)12-5-7-13(8-6-12)15-11-17(3)4/h5-8,11H,9-10H2,1-4H3
charge 0 multiplicity 1
40 atoms
O  -2.41022 0.221021 -0.758979
O  -2.40216 1.500831 1.19661
N  -6.043631 -0.666137 -0.169604
N  5.936819 -0.962323 -0.08368
N  3.937337 0.20309 0.398689
C  -4.58908 -0.642593 0.105902
C  -3.890232 0.372109 -0.821133
C  -6.873451 -0.914132 1.025153
C  -6.408763 -1.544747 -1.297353
C  -0.301216 0.645141 0.29782
C  -1.769637 0.847984 0.324749
C  0.483343 1.235241 1.327848
C  0.347267 -0.099479 -0.723416
C  2.535395 0.308963 0.33675
C  1.876464 1.076577 1.343688
C  1.742904 -0.262545 -0.70927
C  4.563985 -0.883778 0.004914
C  6.781406 0.202909 0.215383
C  6.610137 -2.221427 -0.417873
H  -4.112984 -1.645425 -0.023738
H  -4.422232 -0.329607 1.150856
H  -4.170956 1.399668 -0.535879
H  -4.131743 0.189972 -1.880377
H  -6.625863 -0.178858 1.810273
H  -6.745407 -1.940093 1.45509
H  -7.940684 -0.78803 0.765852
H  -7.475144 -1.403917 -1.550328
H  -6.243899 -2.630842 -1.077655
H  -5.816064 -1.28803 -2.192824
H  -0.026929 1.81615 2.103363
H  -0.255942 -0.533419 -1.526051
H  2.489404 1.531122 2.128129
H  2.235838 -0.802551 -1.526604
H  4.04915 -1.829094 -0.253691
H  7.46678 -0.018717 1.056282
H  6.121527 1.039283 0.491849
H  7.38627 0.484084 -0.668293
H  7.263249 -2.094841 -1.303157
H  5.864085 -3.001186 -0.646365
H  7.236878 -2.575472 0.42477
