program: Gaussian 09
title: 000299759
version: EM64L-G09RevD.01
frameworkgroup: C1[X(C14H24N2O)]
method: RPBEPBE
basis: SDD
operation: Freq
keyword: #p
keyword: freq=noraman
keyword: PBEPBE/SDD
title: #p freq=noraman PBEPBE/SDD
converged: YES YES NO NO
title: Mulliken charges:
elementType: O N N C C C C C C C C C C C C C C H H H H H H H H H H H H H H H H H H H H H H H H
charge: -0.277707 -0.062090 -0.396096 -0.179987 -0.019936 -0.036629 -0.502357 -0.542374 -0.026779 -0.491473 -0.477606 -0.449640 -0.388611 -0.404334 -0.399013 0.231343 -0.782831 0.208992 0.237367 0.210469 0.185728 0.240280 0.214090 0.188874 0.274202 0.191676 0.223544 0.208698 0.211240 0.207648 0.208569 0.209314 0.177520 0.213713 0.195969 0.203669 0.193228 0.290028 0.252452 0.208053 0.250796
chargesum: 0.00000
title: Mulliken charges with hydrogens summed into heavy atoms:
elementType: O N N C C C C C C C C C C C C C C
charge: -0.277707 -0.062090 -0.106068 0.029005 0.217431 0.173840 -0.076349 -0.139409 0.247423 -0.076253 -0.057668 -0.033422 -0.001777 0.005349 -0.002116 0.231343 -0.071530
polarizability: 1.91975103e+02 1.63920351e-02 1.49621976e+02 2.30494859e+00 -3.05211179e-01 1.36529790e+02
1716.lowfreq: -35.3642 -17.7136 -1.4618 -0.0007 -0.0005 0.0003 21.3824 53.5054 72.4864
frequency: 19.8385 52.7790 72.3721 98.0632 122.9507 131.3221 164.1535 188.7994 236.5262 249.0784 271.7063 297.8508 308.7100 354.9918 368.7311 388.0586 393.9918 415.5055 442.5431 470.0770 487.4068 498.7562 525.8386 571.2446 586.2444 597.4529 614.9720 667.6720 749.8877 789.7778 831.1029 844.6685 846.3946 865.1970 871.1349 893.6468 906.8952 926.3107 935.4761 973.1265 982.7476 989.2015 1017.3808 1035.6949 1039.8893 1043.2078 1047.2345 1069.2997 1082.9540 1096.5752 1097.7771 1104.6688 1116.9322 1132.6484 1163.1864 1169.8999 1177.6101 1188.9876 1203.0354 1219.3759 1239.3242 1251.6606 1260.5175 1269.8526 1279.9749 1290.1252 1296.9088 1307.6647 1310.6680 1323.0929 1327.5654 1334.1231 1337.4022 1340.0052 1342.7776 1345.6374 1354.5989 1365.3352 1366.4372 1370.4962 1386.0809 1450.3561 1453.6410 1455.5191 1456.0901 1463.0902 1463.8643 1465.3020 1467.1540 1470.3644 1478.3236 1486.2331 1613.3568 2850.9374 2916.6823 2940.0692 2946.6725 2948.4051 2961.4464 2965.4393 2973.0916 2976.7092 2979.0742 2985.1953 2993.0297 3009.9789 3013.8394 3018.1113 3024.9038 3028.7588 3030.6210 3039.9162 3042.7090 3050.8886 3094.4174 3097.2974 3541.6733
redmass: 5.3177 3.8150 2.9933 1.1250 2.9143 2.7547 2.2676 3.9167 3.4199 2.8051 3.3674 2.0607 2.0549 2.8457 3.5439 2.6672 2.1798 2.8617 2.5892 2.4545 2.2348 2.3891 1.6890 3.0125 2.1296 3.2022 3.0503 3.3538 2.1780 2.6553 1.9380 1.6153 2.1874 2.1256 2.0291 1.8372 2.2496 2.2786 2.7647 1.8980 2.0062 2.1938 1.9451 1.6764 1.6721 1.6872 1.6352 1.8643 2.1963 2.5770 2.3327 1.8916 2.4527 2.4417 2.2513 1.9027 1.4363 1.6014 1.5489 1.4641 1.5139 1.3370 1.2106 1.3260 1.4594 1.5250 1.3587 1.3926 1.2689 1.4108 1.3958 1.5675 1.4586 1.3379 1.3973 1.3889 1.3837 1.4239 1.4040 1.4506 1.2372 1.0471 1.0905 1.0909 1.0906 1.0911 1.2015 1.0928 1.0923 1.0909 1.7306 1.0843 6.5522 1.0704 1.0821 1.0650 1.0656 1.0675 1.0632 1.0747 1.0628 1.0622 1.0812 1.0632 1.0361 1.0870 1.0876 1.0972 1.0931 1.0994 1.0979 1.0992 1.1022 1.1033 1.1002 1.0981 1.0775
irintensity: 7.9859 3.0740 6.0742 0.3301 2.7955 0.1312 0.5072 1.9496 1.3990 1.7260 0.6209 1.1824 2.1120 1.4559 0.8078 1.5477 0.2702 4.9012 4.9966 3.2634 10.4174 13.1543 78.5055 0.5871 0.9989 1.5734 2.6915 0.2431 0.6056 9.2227 14.0247 6.0136 0.1937 2.2149 1.2693 2.4154 1.6423 2.9668 0.7036 17.6259 2.2057 1.9268 1.9468 6.5489 17.7997 2.7623 13.9278 8.7105 1.2846 7.5608 11.7736 14.3271 21.3730 0.3219 10.1129 13.5147 2.2807 2.5816 2.6153 1.2733 16.7531 2.1401 10.3960 12.0943 42.4224 3.4687 14.3065 15.0041 19.8301 4.1384 5.0888 1.2732 1.8555 5.6357 1.9999 1.7642 0.9035 0.7720 2.1999 1.0534 64.1269 13.5359 4.2955 9.9171 11.4964 5.4643 111.3779 17.1548 16.0311 16.8768 167.1615 4.4208 175.9609 72.7605 20.0052 31.0882 15.1713 9.5483 53.2064 87.3816 21.4170 39.7671 48.3688 34.0953 15.2929 10.9689 51.5561 30.1334 48.3555 77.7163 56.6889 11.0821 80.6689 79.2409 22.2607 10.6423 12.1281
temp: 298.150 k
press: 1.00000 atm
elementType: 8 7 7 6 6 6 6 6 6 6 6 6 6 6 6 6 6 1 1 1 1 1 1 1 1 1 1 1 1 1 1 1 1 1 1 1 1 1 1 1 1
symmnumber: 1
zpe: 956192.9 jmol-1
zpe.correction: 0.364195 hartree
zpe.thermalcorrener: 0.380274 hartree
zpe.thermalcorrenthalpy: 0.381218 hartree
zpe.thermalcorrgfe: 0.320533 hartree
zpe.sumelectzpe: -731.289289 hartree
zpe.sumelectthermal: -731.273209 hartree
zpe.sumelectthermalent: -731.272265 hartree
zpe.sumelectthermalfe: -731.332951 hartree
dipole: 0.3923 0.2098 -3.1276
dipole: 3.1591
quadrupole: -103.1387 -102.7722 -107.8745
quadrupole: -3.6966 17.2715 2.0838
quadrupole: 1.4564 1.8229 -3.2793 -3.6966 17.2715 2.0838
hfenergy: -731.6534836 hartree
pointgroup: C01 [X(C14H24N2O1)]
dipole: 0.1472011 0.0684965 1.2322275 debye
polarizability: 191.405383|-5.1156529|149.9195755|-1.7934234|-1.86236|136.8019099 unknown
InChI: InChI=1S/C14H24N2O/c1-10(17)15-13-8-11-4-2-6-16-7-3-5-12(9-13)14(11)16/h11-15H,2-9H2,1H3
charge 0 multiplicity 1
41 atoms
O  -3.643046 0.637034 -1.719026
N  2.778602 -0.337896 0.44349
N  -2.978566 0.361262 0.49123
C  1.356906 0.0191 0.726086
C  0.747239 0.984631 -0.340535
C  0.505044 -1.26085 0.950793
C  -0.717445 1.325464 0.012107
C  -0.974249 -0.892208 1.233102
C  -1.574416 0.04341 0.158601
C  1.627043 2.257042 -0.44261
C  0.67143 -2.26762 -0.215694
C  3.619414 0.883467 0.341915
C  2.960463 -1.287628 -0.683287
C  3.10972 1.904619 -0.713995
C  2.167855 -2.585496 -0.43186
C  -3.922127 0.652925 -0.479495
C  -5.321385 0.988389 0.034388
H  1.364288 0.582807 1.687353
H  0.757008 0.478104 -1.328995
H  0.914063 -1.754281 1.856712
H  -0.745828 1.890976 0.968739
H  -1.161472 1.972781 -0.767596
H  -1.582113 -1.815521 1.307309
H  -1.033957 -0.380295 2.219111
H  -1.603731 -0.465296 -0.823296
H  1.555224 2.814969 0.516342
H  1.234203 2.928192 -1.23147
H  0.241525 -1.86145 -1.153215
H  0.108715 -3.193534 0.01432
H  4.65869 0.575219 0.11966
H  3.625864 1.372602 1.338055
H  4.041908 -1.511156 -0.759618
H  2.646144 -0.867346 -1.672307
H  3.211917 1.475617 -1.730793
H  3.737373 2.817004 -0.684893
H  2.575254 -3.085249 0.46842
H  2.300844 -3.272147 -1.289984
H  -3.239599 0.415887 1.47757
H  -6.046232 0.286787 -0.413247
H  -5.412861 0.94308 1.133882
H  -5.597204 2.001805 -0.305374
